program: Orca
programVersion: 5.0.2
elementType: Br F F O O O C C C C C C C C C C C C C C C C C C C C C C C C H H H H H H H H H H H H H H H H H H H H H H H
charge: 0
multiplicity: 1
keywords: wb97x-d3
keywords: def2-TZVPP
keywords: def2/J RIJCOSX
keywords: DEFGRID2
keywords: scfconv7
keywords: smallprint printgap noloewdin
keywords: NOSOSCF
formula: C24H23BrF2O3
InChI: InChI=1/C24H23BrF2O3/c1-23(2,19-11-13-21(14-12-19)30-24(25,26)27)17-28-16-18-7-6-10-22(15-18)29-20-8-4-3-5-9-20/h3-15H,16-17H2,1-2H3
53 atoms
Br 1.525165 -1.027926 -2.605119
F  3.228239 -3.025083 -2.014777
F  2.992627 -1.588781 -0.437142
O  -3.933224 0.240395 -0.339551
O  1.457679 -3.15666 -0.823401
O  0.854017 3.688758 0.428248
C  -3.584131 -1.566284 1.309641
C  -3.790678 -0.067386 1.031173
C  -2.240898 -2.013977 0.749131
C  -4.755085 -2.352812 0.72336
C  -3.597562 -1.751932 2.832162
C  -1.057856 -1.475292 1.261204
C  -2.129115 -2.932045 -0.290625
C  -2.778323 0.696867 -1.006556
C  0.186161 -1.822926 0.762607
C  -0.893014 -3.287704 -0.813306
C  0.25205 -2.725396 -0.286873
C  -2.286078 2.028007 -0.498018
C  -0.934521 2.210859 -0.237337
C  -3.17243 3.085419 -0.302878
C  -0.472924 3.444555 0.209107
C  -2.70101 4.310798 0.139189
C  -1.35094 4.499201 0.403331
C  2.330469 -2.301696 -1.359158
C  1.649428 2.719829 0.975531
C  1.243606 1.962485 2.068459
C  2.916689 2.558643 0.433915
C  2.119366 1.032122 2.609632
C  3.785437 1.631337 0.991586
C  3.390207 0.860102 2.075848
H  -4.718151 0.244039 1.522837
H  -2.983825 0.515369 1.491801
H  -4.67522 -3.417782 0.949112
H  -5.691194 -1.998747 1.159377
H  -4.841665 -2.247228 -0.358082
H  -3.425474 -2.796006 3.098386
H  -4.565732 -1.460643 3.24447
H  -2.837164 -1.152875 3.335149
H  -1.091968 -0.75428 2.06853
H  -3.009551 -3.384079 -0.7253
H  -1.962264 -0.032479 -0.972085
H  -3.066102 0.791437 -2.057217
H  1.0749 -1.392571 1.203724
H  -0.826705 -3.997075 -1.62852
H  -0.245523 1.387112 -0.386322
H  -4.229186 2.954276 -0.499972
H  -3.38968 5.13266 0.287581
H  -0.982143 5.454998 0.753708
H  0.260037 2.097399 2.501437
H  3.220503 3.15853 -0.414901
H  1.804143 0.443295 3.461703
H  4.77469 1.510195 0.569396
H  4.068251 0.135116 2.506415
elementType: Br F O C H
totalener: -3928.11289428 hartree
nucrepener: 3644.69890445 hartree
electener: -7572.81179873 hartree
twoeener: 5112.92688741 hartree
cpcmener: -0.02188348 hartree
kineticenergy: 3918.78299855 hartree
xcener: -198.381095011366 hartree
chargesum: 0.0000000
charge: -0.077683 -0.148849 -0.154535 -0.386173 -0.266268 -0.332201 0.390815 -0.088228 -0.074354 -0.372220 -0.342325 -0.235737 -0.165728 0.153878 -0.139927 -0.119967 0.120880 0.012386 -0.179688 -0.259366 0.262661 -0.112717 -0.248277 0.428497 0.302023 -0.197470 -0.249044 -0.159365 -0.119135 -0.187598 0.115773 0.110343 0.110695 0.103859 0.094784 0.108851 0.103941 0.102034 0.140503 0.142887 0.061769 0.111648 0.165899 0.147794 0.111225 0.136238 0.156057 0.144741 0.156514 0.144921 0.160600 0.157221 0.157423
qa: -0.0777 -0.1488 -0.1545 -0.3862 -0.2663 -0.3322 0.3908 -0.0882 -0.0744 -0.3722 -0.3423 -0.2357 -0.1657 0.1539 -0.1399 -0.1200 0.1209 0.0124 -0.1797 -0.2594 0.2627 -0.1127 -0.2483 0.4285 0.3020 -0.1975 -0.2490 -0.1594 -0.1191 -0.1876 0.1158 0.1103 0.1107 0.1039 0.0948 0.1089 0.1039 0.1020 0.1405 0.1429 0.0618 0.1116 0.1659 0.1478 0.1112 0.1362 0.1561 0.1447 0.1565 0.1449 0.1606 0.1572 0.1574
va: 1.1767 1.1471 1.1295 1.9324 2.1132 2.0772 3.5764 3.9518 3.5917 3.9228 3.9306 3.9851 3.9266 3.8406 3.9303 4.0083 3.8287 3.5811 3.9050 3.9835 3.7451 3.9010 4.0058 4.5530 3.6656 3.8733 4.0037 3.8354 3.8632 3.8663 1.0072 0.9905 0.9995 1.0054 1.0146 1.0020 1.0044 1.0007 1.0027 0.9983 0.9970 0.9913 1.0017 1.0043 1.0166 1.0171 0.9890 1.0075 0.9975 1.0078 0.9901 0.9883 0.9903
dispcorr: -0.033488209 hartree
energy: -3928.146382492740
dipole: -54.14085 53.18581 -0.95504 16.07260 -16.39082 -0.31822 48.00561 -46.91420 1.09141
magnitude: 1.48477 au
magnitude: 3.77400 debye
