program: Orca
programVersion: 5.0.2
elementType: Br F F O O O C C C C C C C C C C C C C C C C C C C C C C C C H H H H H H H H H H H H H H H H H H H H H H H
charge: 0
multiplicity: 1
keywords: wb97x-d3
keywords: def2-TZVPP
keywords: def2/J RIJCOSX
keywords: DEFGRID2
keywords: scfconv7
keywords: smallprint printgap noloewdin
keywords: NOSOSCF
formula: C24H23BrF2O3
InChI: InChI=1/C24H23BrF2O3/c1-23(2,19-11-13-21(14-12-19)30-24(25,26)27)17-28-16-18-7-6-10-22(15-18)29-20-8-4-3-5-9-20/h3-15H,16-17H2,1-2H3
53 atoms
Br 2.426534 -4.976135 0.056797
F  2.414543 -2.301332 -0.006163
F  0.895997 -3.182529 -1.233866
O  -3.142939 1.237536 -1.235889
O  0.638619 -3.21785 0.974273
O  1.891913 3.795313 -0.676229
C  -3.473634 0.744377 1.091802
C  -3.148069 1.815826 0.048376
C  -2.385213 -0.322015 1.035943
C  -4.869719 0.1781 0.831875
C  -3.484491 1.418844 2.468955
C  -2.634233 -1.627539 0.621511
C  -1.074176 0.000363 1.392596
C  -2.412904 1.96655 -2.199421
C  -1.62382 -2.578833 0.569306
C  -0.052745 -0.93543 1.355411
C  -0.343947 -2.223965 0.944303
C  -0.929299 1.842997 -1.971442
C  -0.205773 2.909123 -1.454105
C  -0.286372 0.628912 -2.207409
C  1.145107 2.756406 -1.162863
C  1.066011 0.495197 -1.940684
C  1.78909 1.55444 -1.405738
C  1.501496 -3.282897 -0.045851
C  1.410211 4.549097 0.357841
C  0.675528 3.999617 1.40336
C  1.732781 5.89966 0.356799
C  0.257085 4.818482 2.442914
C  1.317257 6.703491 1.408716
C  0.572523 6.170617 2.45274
H  -3.892434 2.623643 0.102108
H  -2.176976 2.265261 0.290903
H  -5.144108 -0.566678 1.581282
H  -5.606723 0.981684 0.888281
H  -4.971308 -0.284412 -0.14994
H  -3.684182 0.691412 3.257204
H  -4.267293 2.178764 2.514854
H  -2.540704 1.912692 2.704633
H  -3.629656 -1.93331 0.330828
H  -0.826383 1.00409 1.713861
H  -2.683521 1.545139 -3.169727
H  -2.709235 3.023189 -2.209545
H  -1.843135 -3.591836 0.256262
H  0.946468 -0.658254 1.664508
H  -0.700749 3.857422 -1.27576
H  -0.843594 -0.210762 -2.605816
H  1.566676 -0.443334 -2.138042
H  2.843486 1.448196 -1.183212
H  0.433905 2.944067 1.417846
H  2.308731 6.31498 -0.461248
H  -0.31553 4.388435 3.255295
H  1.573115 7.755348 1.404705
H  0.244634 6.801716 3.268599
elementType: Br F O C H
totalener: -3928.11314289 hartree
nucrepener: 3493.34231698 hartree
electener: -7421.45545987 hartree
twoeener: 4962.00104362 hartree
cpcmener: -0.02471005 hartree
kineticenergy: 3918.79365600 hartree
xcener: -198.376599808684 hartree
chargesum: 0.0000000
charge: -0.041499 -0.165598 -0.162711 -0.371095 -0.291031 -0.333413 0.397180 -0.073166 -0.053796 -0.368561 -0.336348 -0.161207 -0.215350 0.059124 -0.173322 -0.237001 0.242455 0.078940 -0.218545 -0.274579 0.276833 -0.122821 -0.237349 0.429602 0.265062 -0.174385 -0.220316 -0.191209 -0.139678 -0.163818 0.108321 0.083641 0.111594 0.103377 0.096936 0.110468 0.104520 0.098353 0.142618 0.152811 0.109618 0.096167 0.146685 0.145789 0.147388 0.137352 0.152568 0.144538 0.167613 0.144957 0.157389 0.156960 0.157937
qa: -0.0415 -0.1656 -0.1627 -0.3711 -0.2910 -0.3334 0.3972 -0.0732 -0.0538 -0.3686 -0.3363 -0.1612 -0.2154 0.0591 -0.1733 -0.2370 0.2425 0.0789 -0.2185 -0.2746 0.2768 -0.1228 -0.2373 0.4296 0.2651 -0.1744 -0.2203 -0.1912 -0.1397 -0.1638 0.1083 0.0836 0.1116 0.1034 0.0969 0.1105 0.1045 0.0984 0.1426 0.1528 0.1096 0.0962 0.1467 0.1458 0.1474 0.1374 0.1526 0.1445 0.1676 0.1450 0.1574 0.1570 0.1579
va: 1.1868 1.1296 1.1326 1.9329 2.1073 2.0776 3.5385 4.0032 3.6080 3.9230 3.9295 3.9310 3.9244 3.9117 4.0717 4.0324 3.6851 3.4937 3.8845 3.9338 3.7087 3.8257 4.0127 4.5302 3.7248 3.8394 3.9813 3.9376 3.9021 3.8879 1.0062 0.9775 0.9993 1.0057 1.0118 1.0020 1.0035 0.9997 0.9977 0.9916 0.9899 0.9966 1.0043 1.0087 1.0057 1.0094 1.0037 1.0064 0.9899 1.0082 0.9933 0.9894 0.9900
dispcorr: -0.032398254 hartree
energy: -3928.145541141510
dipole: -59.85624 58.57977 -1.27648 90.32351 -89.09642 1.22709 10.16380 -9.54089 0.62291
magnitude: 1.87701 au
magnitude: 4.77097 debye
