program: Orca
programVersion: 5.0.2
elementType: Br F F O O O C C C C C C C C C C C C C C C C C C C C C C C C H H H H H H H H H H H H H H H H H H H H H H H
charge: 0
multiplicity: 1
keywords: wb97x-d3
keywords: def2-TZVPP
keywords: def2/J RIJCOSX
keywords: DEFGRID2
keywords: scfconv7
keywords: smallprint printgap noloewdin
keywords: NOSOSCF
formula: C24H23BrF2O3
InChI: InChI=1/C24H23BrF2O3/c1-23(2,19-11-13-21(14-12-19)30-24(25,26)27)17-28-16-18-7-6-10-22(15-18)29-20-8-4-3-5-9-20/h3-15H,16-17H2,1-2H3
53 atoms
Br 2.797585 -2.764471 1.486159
F  3.056431 -2.498343 -1.165174
F  3.52589 -4.47181 -0.46324
O  -4.143359 1.154248 0.825006
O  1.457846 -3.952538 -0.636358
O  0.110459 4.705934 -0.445296
C  -3.375983 -1.022039 0.143869
C  -2.985074 0.374143 0.64838
C  -2.075304 -1.798216 -0.040245
C  -4.108961 -0.919352 -1.200611
C  -4.307131 -1.692963 1.154072
C  -1.744304 -2.902368 0.741385
C  -1.162972 -1.412421 -1.025902
C  -3.893198 2.45704 1.304612
C  -0.558644 -3.597928 0.551463
C  0.024559 -2.095534 -1.235681
C  0.316166 -3.185234 -0.433087
C  -3.204599 3.318131 0.278589
C  -1.862732 3.640425 0.424626
C  -3.890893 3.740061 -0.858534
C  -1.208556 4.362688 -0.566632
C  -3.236731 4.481478 -1.828953
C  -1.888321 4.788651 -1.696083
C  2.664957 -3.471545 -0.332582
C  1.004616 3.767202 -0.005973
C  0.95303 2.444379 -0.43111
C  2.007583 4.19586 0.851588
C  1.913195 1.549477 0.017321
C  2.968362 3.291845 1.282593
C  2.923035 1.966152 0.87452
H  -2.435675 0.282547 1.59772
H  -2.301737 0.846241 -0.069429
H  -3.540057 -0.359306 -1.943686
H  -4.303033 -1.911868 -1.610443
H  -5.071286 -0.420266 -1.084502
H  -5.245881 -1.145732 1.229532
H  -3.875087 -1.734266 2.155656
H  -4.554245 -2.711854 0.85138
H  -2.411124 -3.248441 1.518335
H  -1.378075 -0.567692 -1.6677
H  -4.868351 2.878002 1.558515
H  -3.299473 2.426807 2.227687
H  -0.326517 -4.458937 1.165112
H  0.689064 -1.786464 -2.031193
H  -1.328138 3.315722 1.310258
H  -4.938891 3.494091 -0.981193
H  -3.772904 4.81617 -2.707749
H  -1.370902 5.354231 -2.460831
H  0.177486 2.110116 -1.10911
H  2.036112 5.228835 1.175417
H  1.872028 0.519566 -0.314728
H  3.7514 3.628428 1.949897
H  3.670112 1.263103 1.218614
elementType: Br F O C H
totalener: -3928.11520009 hartree
nucrepener: 3464.68776385 hartree
electener: -7392.80296394 hartree
twoeener: 4932.59736462 hartree
cpcmener: -0.02225685 hartree
kineticenergy: 3918.78585811 hartree
xcener: -198.376390227809 hartree
chargesum: 0.0000000
charge: -0.078174 -0.159518 -0.148733 -0.365320 -0.272271 -0.334088 0.417169 -0.072126 -0.060742 -0.355460 -0.376855 -0.158739 -0.205165 0.053500 -0.143948 -0.191098 0.160298 0.015642 -0.173001 -0.246970 0.246523 -0.123230 -0.232490 0.431221 0.281439 -0.205585 -0.247454 -0.113140 -0.113844 -0.196663 0.100306 0.094870 0.098020 0.112184 0.097072 0.099292 0.100502 0.111121 0.146455 0.148658 0.110345 0.098212 0.149544 0.151725 0.143817 0.141745 0.157509 0.146280 0.155342 0.145245 0.153394 0.156973 0.150211
qa: -0.0782 -0.1595 -0.1487 -0.3653 -0.2723 -0.3341 0.4172 -0.0721 -0.0607 -0.3555 -0.3769 -0.1587 -0.2052 0.0535 -0.1439 -0.1911 0.1603 0.0156 -0.1730 -0.2470 0.2465 -0.1232 -0.2325 0.4312 0.2814 -0.2056 -0.2475 -0.1131 -0.1138 -0.1967 0.1003 0.0949 0.0980 0.1122 0.0971 0.0993 0.1005 0.1111 0.1465 0.1487 0.1103 0.0982 0.1495 0.1517 0.1438 0.1417 0.1575 0.1463 0.1553 0.1452 0.1534 0.1570 0.1502
va: 1.1782 1.1260 1.1477 1.9413 2.1039 2.0716 3.4931 4.0001 3.6401 3.9306 3.9364 3.9346 3.9887 3.9079 4.0120 4.0083 3.7679 3.5325 3.8598 3.9663 3.7382 3.8975 4.0103 4.5542 3.7050 3.9194 4.0090 3.8604 3.8888 3.9242 1.0027 0.9809 1.0050 1.0007 1.0137 1.0189 0.9998 0.9986 0.9982 0.9976 0.9910 0.9997 1.0043 1.0085 1.0070 1.0055 0.9885 1.0056 0.9992 1.0079 0.9884 0.9887 0.9959
dispcorr: -0.029765910 hartree
energy: -3928.144966002683
dipole: -71.56967 70.56597 -1.00370 49.68919 -49.46624 0.22295 -11.95623 12.27743 0.32120
magnitude: 1.07717 au
magnitude: 2.73794 debye
