program: Orca
programVersion: 5.0.2
elementType: Br F F O O O C C C C C C C C C C C C C C C C C C C C C C C C H H H H H H H H H H H H H H H H H H H H H H H
charge: 0
multiplicity: 1
keywords: wb97x-d3
keywords: def2-TZVPP
keywords: def2/J RIJCOSX
keywords: DEFGRID2
keywords: scfconv7
keywords: smallprint printgap noloewdin
keywords: NOSOSCF
formula: C24H23BrF2O3
InChI: InChI=1/C24H23BrF2O3/c1-23(2,19-11-13-21(14-12-19)30-24(25,26)27)17-28-16-18-7-6-10-22(15-18)29-20-8-4-3-5-9-20/h3-15H,16-17H2,1-2H3
53 atoms
Br 2.754471 -2.622831 1.77555
F  2.945449 -2.416615 -0.885419
F  3.459196 -4.369425 -0.146646
O  -4.072987 1.37713 1.008646
O  1.381618 -3.878707 -0.287405
O  0.22083 4.564125 -1.043494
C  -3.411526 -0.87401 0.452156
C  -2.957429 0.528485 0.877799
C  -2.135649 -1.689907 0.268343
C  -4.180834 -0.804793 -0.873986
C  -4.333037 -1.466438 1.517716
C  -1.254385 -1.375857 -0.769127
C  -1.787798 -2.745813 1.106618
C  -3.734668 2.72968 1.225126
C  -0.075535 -2.075413 -0.968324
C  -0.608912 -3.456751 0.928035
C  0.240148 -3.108368 -0.102725
C  -3.065371 3.341474 0.021967
C  -1.724998 3.697391 0.069886
C  -3.770095 3.485554 -1.171926
C  -1.092959 4.182522 -1.069001
C  -3.136291 3.988929 -2.295953
C  -1.790474 4.331846 -2.255884
C  2.587785 -3.374899 -0.022067
C  1.151214 3.727634 -0.489892
C  2.198518 4.318776 0.203627
C  1.098304 2.347351 -0.650365
C  3.201146 3.521668 0.736681
C  2.103893 1.562851 -0.104019
C  3.157469 2.141774 0.59083
H  -2.407428 0.467259 1.829058
H  -2.255974 0.921057 0.131245
H  -4.406224 -1.807153 -1.241679
H  -5.129312 -0.282358 -0.748289
H  -3.624674 -0.282269 -1.653183
H  -3.866223 -1.496757 2.50323
H  -4.642384 -2.479962 1.259172
H  -5.238909 -0.869096 1.609627
H  -1.484802 -0.572682 -1.45686
H  -2.433172 -3.039682 1.922038
H  -4.672858 3.244851 1.442137
H  -3.091137 2.839071 2.107714
H  0.567029 -1.821258 -1.800307
H  -0.362126 -4.278824 1.587838
H  -1.172643 3.585277 0.996369
H  -4.816123 3.207771 -1.221716
H  -3.686396 4.105534 -3.220865
H  -1.288526 4.711348 -3.137104
H  2.227963 5.395022 0.320579
H  0.290272 1.881337 -1.20066
H  4.016811 3.986243 1.275942
H  2.064396 0.488918 -0.235081
H  3.938498 1.522806 1.01266
elementType: Br F O C H
totalener: -3928.11482285 hartree
nucrepener: 3475.44663467 hartree
electener: -7403.56145752 hartree
twoeener: 4943.33826088 hartree
cpcmener: -0.02206301 hartree
kineticenergy: 3918.79746408 hartree
xcener: -198.378878549056 hartree
chargesum: -0.0000000
charge: -0.078503 -0.158186 -0.149404 -0.365478 -0.272744 -0.334252 0.435900 -0.085858 -0.070483 -0.365810 -0.370469 -0.193328 -0.162358 0.061165 -0.198652 -0.144061 0.165936 0.028146 -0.173384 -0.253928 0.241557 -0.123739 -0.227334 0.430818 0.278802 -0.246025 -0.202992 -0.111116 -0.110813 -0.201943 0.102393 0.089289 0.113763 0.097199 0.096334 0.098685 0.112203 0.100101 0.149448 0.146110 0.111501 0.096714 0.151199 0.149505 0.142271 0.141546 0.157052 0.146997 0.145160 0.154006 0.156599 0.148254 0.152205
qa: -0.0785 -0.1582 -0.1494 -0.3655 -0.2727 -0.3343 0.4359 -0.0859 -0.0705 -0.3658 -0.3705 -0.1933 -0.1624 0.0612 -0.1987 -0.1441 0.1659 0.0281 -0.1734 -0.2539 0.2416 -0.1237 -0.2273 0.4308 0.2788 -0.2460 -0.2030 -0.1111 -0.1108 -0.2019 0.1024 0.0893 0.1138 0.0972 0.0963 0.0987 0.1122 0.1001 0.1494 0.1461 0.1115 0.0967 0.1512 0.1495 0.1423 0.1415 0.1571 0.1470 0.1452 0.1540 0.1566 0.1483 0.1522
va: 1.1773 1.1257 1.1468 1.9418 2.1042 2.0687 3.4591 4.0232 3.6607 3.9326 3.9302 3.9750 3.9440 3.9045 4.0132 4.0098 3.7634 3.5329 3.8770 3.9558 3.7386 3.8969 4.0105 4.5536 3.7087 4.0033 3.9132 3.8848 3.8648 3.9240 1.0054 0.9769 1.0018 1.0130 1.0056 1.0005 0.9990 1.0183 0.9960 0.9985 0.9902 0.9996 1.0083 1.0042 1.0080 1.0071 0.9887 1.0049 1.0082 1.0000 0.9887 0.9871 0.9945
dispcorr: -0.030102235 hartree
energy: -3928.144925084486
dipole: -70.02336 69.03767 -0.98569 49.12593 -48.87013 0.25580 -15.46758 15.76566 0.29809
magnitude: 1.06108 au
magnitude: 2.69704 debye
