program: Orca
programVersion: 5.0.2
elementType: Br F F O O O C C C C C C C C C C C C C C C C C C C C C C C C H H H H H H H H H H H H H H H H H H H H H H H
charge: 0
multiplicity: 1
keywords: wb97x-d3
keywords: def2-TZVPP
keywords: def2/J RIJCOSX
keywords: DEFGRID2
keywords: scfconv7
keywords: smallprint printgap noloewdin
keywords: NOSOSCF
formula: C24H23BrF2O3
InChI: InChI=1/C24H23BrF2O3/c1-23(2,19-11-13-21(14-12-19)30-24(25,26)27)17-28-16-18-7-6-10-22(15-18)29-20-8-4-3-5-9-20/h3-15H,16-17H2,1-2H3
53 atoms
Br 3.031976 -4.502832 -0.126975
F  0.545567 -4.838519 0.807477
F  1.653422 -3.351955 1.871952
O  -3.993435 0.95334 -0.751691
O  0.91935 -2.87548 -0.173992
O  0.338586 4.884897 -1.254448
C  -3.86174 -0.158262 1.375935
C  -3.891875 1.180672 0.634308
C  -2.601428 -0.910862 0.964486
C  -5.137746 -0.945342 1.076699
C  -3.835809 0.142014 2.878875
C  -1.346895 -0.437091 1.353659
C  -2.636775 -2.051881 0.167827
C  -3.609236 2.053127 -1.540064
C  -0.177086 -1.086439 0.996372
C  -1.475441 -2.718771 -0.20196
C  -0.25649 -2.232044 0.225255
C  -2.111786 2.226549 -1.591999
C  -1.534019 3.468354 -1.361529
C  -1.292681 1.133941 -1.865961
C  -0.155662 3.621148 -1.429496
C  0.082268 1.29572 -1.925266
C  0.66417 2.538337 -1.714679
C  1.39981 -3.820652 0.643819
C  1.452717 5.092571 -0.490892
C  2.298937 6.120656 -0.883986
C  1.717011 4.362413 0.662001
C  3.415826 6.418819 -0.117515
C  2.844567 4.664862 1.41197
C  3.699009 5.689427 1.028907
H  -4.747626 1.775424 0.985412
H  -2.986978 1.75287 0.878149
H  -5.149658 -1.896035 1.612071
H  -6.007292 -0.375149 1.407974
H  -5.277242 -1.158507 0.017771
H  -4.75618 0.644691 3.181409
H  -3.005899 0.788167 3.166891
H  -3.756302 -0.778544 3.45835
H  -1.263008 0.462718 1.949492
H  -3.578952 -2.45194 -0.179241
H  -3.991282 1.857539 -2.545241
H  -4.084023 2.98092 -1.195644
H  0.782067 -0.689885 1.30289
H  -1.530007 -3.598728 -0.829842
H  -2.155029 4.32577 -1.127832
H  -1.725245 0.156337 -2.038378
H  0.715084 0.445444 -2.144779
H  1.739017 2.653657 -1.775869
H  2.079427 6.685606 -1.781266
H  1.054407 3.567995 0.981339
H  4.072039 7.221997 -0.426752
H  3.0494 4.093721 2.308262
H  4.574849 5.91939 1.620931
elementType: Br F O C H
totalener: -3928.11450888 hartree
nucrepener: 3366.21911971 hartree
electener: -7294.33362859 hartree
twoeener: 4834.97764366 hartree
cpcmener: -0.02302861 hartree
kineticenergy: 3918.81821882 hartree
xcener: -198.381766872479 hartree
chargesum: -0.0000000
charge: -0.040898 -0.160511 -0.160353 -0.368273 -0.296348 -0.331129 0.400162 -0.102817 -0.045680 -0.366983 -0.335318 -0.171801 -0.199051 0.072347 -0.246913 -0.173363 0.253867 0.035201 -0.231621 -0.254132 0.260502 -0.145385 -0.181908 0.418091 0.282661 -0.246944 -0.186532 -0.123724 -0.153600 -0.184665 0.105860 0.107479 0.114284 0.103181 0.095498 0.102926 0.100636 0.109781 0.141804 0.141970 0.107961 0.095725 0.147050 0.148638 0.130432 0.144535 0.158939 0.155215 0.144457 0.156726 0.156888 0.157865 0.157269
qa: -0.0409 -0.1605 -0.1604 -0.3683 -0.2963 -0.3311 0.4002 -0.1028 -0.0457 -0.3670 -0.3353 -0.1718 -0.1991 0.0723 -0.2469 -0.1734 0.2539 0.0352 -0.2316 -0.2541 0.2605 -0.1454 -0.1819 0.4181 0.2827 -0.2469 -0.1865 -0.1237 -0.1536 -0.1847 0.1059 0.1075 0.1143 0.1032 0.0955 0.1029 0.1006 0.1098 0.1418 0.1420 0.1080 0.0957 0.1471 0.1486 0.1304 0.1445 0.1589 0.1552 0.1445 0.1567 0.1569 0.1579 0.1573
va: 1.1879 1.1347 1.1356 1.9355 2.0864 2.0696 3.5513 3.9965 3.6052 3.9209 3.9208 3.9071 3.9481 3.8866 4.0503 4.0691 3.6553 3.5878 4.0294 3.9297 3.7345 3.8653 3.9236 4.5566 3.6983 4.0012 3.8907 3.8895 3.9007 3.9030 1.0024 0.9810 0.9988 1.0053 1.0125 1.0045 1.0030 1.0018 1.0027 0.9994 0.9895 0.9980 1.0063 1.0038 1.0186 1.0043 0.9916 0.9959 1.0087 0.9980 0.9892 0.9911 0.9905
dispcorr: -0.029163774 hartree
energy: -3928.143672650249
dipole: -64.12371 63.41444 -0.70928 81.81247 -80.89826 0.91421 6.54176 -5.94679 0.59497
magnitude: 1.30109 au
magnitude: 3.30711 debye
