program: Orca
programVersion: 5.0.2
elementType: Br F F O O O C C C C C C C C C C C C C C C C C C C C C C C C H H H H H H H H H H H H H H H H H H H H H H H
charge: 0
multiplicity: 1
keywords: wb97x-d3
keywords: def2-TZVPP
keywords: def2/J RIJCOSX
keywords: DEFGRID2
keywords: scfconv7
keywords: smallprint printgap noloewdin
keywords: NOSOSCF
formula: C24H23BrF2O3
InChI: InChI=1/C24H23BrF2O3/c1-23(2,19-11-13-21(14-12-19)30-24(25,26)27)17-28-16-18-7-6-10-22(15-18)29-20-8-4-3-5-9-20/h3-15H,16-17H2,1-2H3
53 atoms
Br 2.099339 -3.649741 -1.740014
F  3.299177 -2.034141 0.027521
F  3.821306 -1.60071 -2.010413
O  -3.982347 0.882063 -0.362856
O  1.9208 -0.912325 -1.31465
O  0.434042 3.356745 -0.304377
C  -3.358201 -1.11326 0.847621
C  -3.862501 0.332644 0.927178
C  -1.94062 -1.110966 0.283273
C  -4.302284 -1.960607 -0.010836
C  -3.404239 -1.668174 2.273995
C  -0.824463 -1.110829 1.118394
C  -1.707248 -1.049668 -1.092717
C  -4.336916 2.238043 -0.377336
C  0.470418 -1.064596 0.620323
C  -0.423279 -1.001238 -1.610719
C  0.656729 -1.014969 -0.747426
C  -3.200767 3.169728 -0.032179
C  -1.881219 2.809308 -0.282001
C  -3.471423 4.430259 0.491984
C  -0.860977 3.70675 -0.009462
C  -2.441512 5.322397 0.750931
C  -1.122897 4.965533 0.506198
C  2.805608 -1.904183 -1.211384
C  1.155899 2.637675 0.599855
C  2.396707 2.182182 0.163875
C  0.724261 2.369941 1.893645
C  3.206525 1.464431 1.027818
C  1.55038 1.649143 2.747452
C  2.790992 1.195218 2.32657
H  -4.839699 0.345328 1.432163
H  -3.171552 0.919903 1.547893
H  -3.97074 -3.000124 -0.038781
H  -5.307019 -1.947644 0.416474
H  -4.389366 -1.615238 -1.039522
H  -2.970277 -2.66774 2.326286
H  -4.439428 -1.742447 2.610642
H  -2.880479 -1.03667 2.993202
H  -0.940732 -1.145051 2.192798
H  -2.529853 -1.043832 -1.793375
H  -4.679178 2.455975 -1.393302
H  -5.188376 2.435163 0.287749
H  1.304103 -1.052414 1.30813
H  -0.266565 -0.94974 -2.680699
H  -1.636894 1.836828 -0.693757
H  -4.495966 4.71848 0.696426
H  -2.664412 6.301627 1.154633
H  -0.311775 5.653062 0.710276
H  2.720902 2.394041 -0.847645
H  -0.238727 2.713769 2.247985
H  4.170867 1.115521 0.681233
H  1.210043 1.443212 3.754379
H  3.425959 0.634066 2.99935
elementType: Br F O C H
totalener: -3928.11550832 hartree
nucrepener: 3605.52057195 hartree
electener: -7533.63608027 hartree
twoeener: 5075.07258840 hartree
cpcmener: -0.02189255 hartree
kineticenergy: 3918.79503944 hartree
xcener: -198.383850227742 hartree
chargesum: -0.0000000
charge: -0.074333 -0.161612 -0.151355 -0.367386 -0.277510 -0.327768 0.409069 -0.105309 0.001743 -0.356162 -0.348619 -0.236726 -0.233661 0.048096 -0.123174 -0.115090 0.102889 -0.013835 -0.167815 -0.182833 0.190386 -0.146595 -0.173672 0.433404 0.340650 -0.255569 -0.207639 -0.119720 -0.164808 -0.199813 0.107402 0.113561 0.109979 0.100647 0.098302 0.118098 0.104595 0.099094 0.144323 0.136734 0.107531 0.098852 0.160174 0.149551 0.144777 0.141096 0.157475 0.147642 0.141295 0.143135 0.151072 0.155744 0.153686
qa: -0.0743 -0.1616 -0.1514 -0.3674 -0.2775 -0.3278 0.4091 -0.1053 0.0017 -0.3562 -0.3486 -0.2367 -0.2337 0.0481 -0.1232 -0.1151 0.1029 -0.0138 -0.1678 -0.1828 0.1904 -0.1466 -0.1737 0.4334 0.3407 -0.2556 -0.2076 -0.1197 -0.1648 -0.1998 0.1074 0.1136 0.1100 0.1006 0.0983 0.1181 0.1046 0.0991 0.1443 0.1367 0.1075 0.0989 0.1602 0.1496 0.1448 0.1411 0.1575 0.1476 0.1413 0.1431 0.1511 0.1557 0.1537
va: 1.1860 1.1297 1.1458 1.9506 2.0673 2.0724 3.5163 3.9659 3.5784 3.9325 3.9170 3.9899 4.0177 3.9110 3.9482 4.0007 3.7548 3.6103 3.9598 3.9301 3.7958 3.8929 3.9571 4.5664 3.6082 3.9346 3.8237 3.8304 3.8781 3.8555 1.0010 0.9848 1.0003 1.0028 1.0104 1.0001 1.0057 1.0004 1.0028 1.0123 0.9892 0.9979 1.0050 1.0023 1.0065 0.9999 0.9899 1.0019 1.0121 1.0080 0.9941 0.9911 0.9916
dispcorr: -0.034179344 hartree
energy: -3928.149687660871
dipole: -65.11195 62.99553 -2.11642 52.69553 -52.23394 0.46158 36.87332 -35.48043 1.39288
magnitude: 2.57535 au
magnitude: 6.54603 debye
