program: Orca
programVersion: 5.0.2
elementType: Br F F O O O C C C C C C C C C C C C C C C C C C C C C C C C H H H H H H H H H H H H H H H H H H H H H H H
charge: 0
multiplicity: 1
keywords: wb97x-d3
keywords: def2-TZVPP
keywords: def2/J RIJCOSX
keywords: DEFGRID2
keywords: scfconv7
keywords: smallprint printgap noloewdin
keywords: NOSOSCF
formula: C24H23BrF2O3
InChI: InChI=1/C24H23BrF2O3/c1-23(2,19-11-13-21(14-12-19)30-24(25,26)27)17-28-16-18-7-6-10-22(15-18)29-20-8-4-3-5-9-20/h3-15H,16-17H2,1-2H3
53 atoms
Br 3.795303 -1.861175 -1.741166
F  1.923196 -3.174311 -0.334013
F  2.767068 -1.495467 0.700515
O  -4.566852 0.478794 -0.404044
O  1.341288 -1.125562 -0.967283
O  0.192465 2.129738 -0.466089
C  -4.123543 -1.662321 0.605608
C  -4.620193 -0.227283 0.813504
C  -2.655874 -1.597099 0.195886
C  -4.990863 -2.369413 -0.437634
C  -4.295916 -2.40407 1.935563
C  -2.245878 -1.738074 -1.127652
C  -1.670765 -1.308966 1.141334
C  -4.644252 1.873804 -0.259288
C  -0.913164 -1.608174 -1.493726
C  -0.334608 -1.170439 0.797194
C  0.031368 -1.32007 -0.528968
C  -3.349517 2.499019 0.199994
C  -2.134141 2.017349 -0.275324
C  -3.356364 3.582874 1.070215
C  -0.94671 2.626059 0.101611
C  -2.163032 4.192935 1.433028
C  -0.949811 3.728032 0.949621
C  2.317553 -1.906977 -0.493509
C  1.369148 2.048025 0.220397
C  1.441796 1.831708 1.591626
C  2.527801 2.117673 -0.543311
C  2.68713 1.697987 2.191066
C  3.762894 1.972287 0.068279
C  3.851074 1.767288 1.438695
H  -5.651802 -0.247793 1.194505
H  -4.004395 0.259216 1.581798
H  -4.999696 -1.873603 -1.407369
H  -4.659268 -3.397776 -0.593149
H  -6.024983 -2.408914 -0.089951
H  -3.883833 -3.41253 1.878706
H  -5.355518 -2.494284 2.181523
H  -3.817444 -1.895073 2.772823
H  -2.961929 -1.95816 -1.90689
H  -1.934554 -1.171563 2.181716
H  -4.904088 2.271153 -1.24463
H  -5.456611 2.163726 0.420194
H  -0.6169 -1.718739 -2.529101
H  0.389048 -0.927385 1.563029
H  -2.098878 1.171221 -0.951308
H  -4.294868 3.955775 1.462646
H  -2.174198 5.043741 2.102297
H  -0.028367 4.221548 1.231082
H  0.546148 1.758869 2.194781
H  2.457033 2.2762 -1.612215
H  2.740721 1.529049 3.259005
H  4.660969 2.022465 -0.53364
H  4.816609 1.657145 1.914518
elementType: Br F O C H
totalener: -3928.11305777 hartree
nucrepener: 3629.29028970 hartree
electener: -7557.40334747 hartree
twoeener: 5099.40449024 hartree
cpcmener: -0.02294428 hartree
kineticenergy: 3918.78844091 hartree
xcener: -198.381688171292 hartree
chargesum: -0.0000000
charge: -0.047396 -0.160037 -0.161168 -0.367408 -0.293375 -0.321444 0.387672 -0.107113 0.004654 -0.354183 -0.337781 -0.231021 -0.208995 0.063194 -0.161391 -0.188919 0.204764 0.031378 -0.303695 -0.200235 0.310603 -0.131874 -0.236546 0.439513 0.350663 -0.242729 -0.275841 -0.140545 -0.103600 -0.192499 0.104740 0.111763 0.093832 0.115104 0.101994 0.111317 0.103185 0.100322 0.139389 0.139978 0.105209 0.097424 0.145533 0.150249 0.148083 0.138956 0.157587 0.154768 0.158124 0.135858 0.156714 0.149440 0.155786
qa: -0.0474 -0.1600 -0.1612 -0.3674 -0.2934 -0.3214 0.3877 -0.1071 0.0047 -0.3542 -0.3378 -0.2310 -0.2090 0.0632 -0.1614 -0.1889 0.2048 0.0314 -0.3037 -0.2002 0.3106 -0.1319 -0.2365 0.4395 0.3507 -0.2427 -0.2758 -0.1405 -0.1036 -0.1925 0.1047 0.1118 0.0938 0.1151 0.1020 0.1113 0.1032 0.1003 0.1394 0.1400 0.1052 0.0974 0.1455 0.1502 0.1481 0.1390 0.1576 0.1548 0.1581 0.1359 0.1567 0.1494 0.1558
va: 1.1824 1.1353 1.1284 1.9436 2.0878 2.0435 3.5727 3.9855 3.5463 3.9130 3.9155 4.0071 4.0091 3.8998 4.0532 4.0304 3.6335 3.5970 4.0104 3.9476 3.7272 3.8967 3.9347 4.5304 3.5039 3.8754 4.0045 3.9028 3.8458 3.9007 1.0024 0.9817 1.0135 0.9995 1.0047 1.0013 1.0044 1.0028 1.0004 1.0057 0.9891 0.9971 1.0049 1.0058 1.0098 1.0026 0.9905 0.9983 0.9995 1.0137 0.9906 0.9923 0.9905
dispcorr: -0.034583493 hartree
energy: -3928.147641261866
dipole: -83.76835 82.27377 -1.49458 28.71189 -28.23083 0.48105 30.62231 -29.41721 1.20509
magnitude: 1.97925 au
magnitude: 5.03086 debye
