program: Gaussian 09
title: 000072139
version: EM64L-G09RevD.01
frameworkgroup: C1[X(C7H4O3S)]
method: RPBEPBE
basis: SDD
operation: Freq
keyword: #pfreq=noraman
keyword: PBEPBE/SDD
title: #p freq=noraman PBEPBE/SDD
converged: NO YES NO YES
title: Mulliken charges:
elementType: S O O O C C C C C C C H H H H
charge: 0.269183 -0.214253 -0.427713 -0.110530 0.596825 -0.445737 -0.504493 -0.214438 0.336391 -0.362843 -0.063794 0.262306 0.253382 0.263319 0.362395
chargesum: 0.00000
title: Mulliken charges with hydrogens summed into heavy atoms:
elementType: S O O O C C C C C C C
charge: 0.269183 -0.214253 -0.065318 -0.110530 0.596825 -0.445737 -0.242188 0.038945 0.336391 -0.099523 -0.063794
polarizability: 1.54427254e+02 2.30219897e+00 1.04124632e+02 1.30766563e-03 4.34690784e-03 3.81885743e+01
1716.lowfreq: -10.9564 -3.1163 -0.0012 -0.0008 0.0016 3.7946 101.5458 129.0058 235.0064
frequency: 101.5451 129.0058 235.0064 263.1966 312.4169 354.1319 368.6668 386.4987 435.6833 451.5618 471.2239 565.1023 584.9241 602.5741 611.3670 679.0062 694.3044 765.4942 811.2323 840.1442 865.8553 944.1450 947.7526 1040.2095 1121.6306 1135.6668 1159.9068 1246.9089 1297.6750 1399.7191 1438.0695 1467.8616 1592.6343 1624.4687 1721.2588 3160.5043 3163.7365 3187.6544 3587.3388
redmass: 10.4269 7.7840 8.6898 7.2617 6.5154 1.1294 6.3856 14.2780 2.8601 9.9764 7.7190 11.4802 10.4650 4.9531 8.4675 7.9846 3.2481 9.3321 1.3369 1.6910 11.3023 1.3338 3.7111 6.8291 1.5259 1.7350 1.3098 1.9848 2.2494 5.1039 4.4526 2.9447 7.3812 7.3665 12.9763 1.0931 1.0897 1.0967 1.0663
irintensity: 0.6244 1.3319 2.5647 0.1041 0.4460 147.9317 5.0646 1.2640 26.1255 4.8166 25.7860 2.2910 20.7139 12.7285 14.7224 1.6858 3.2058 15.5091 14.0582 69.5202 133.8273 0.0856 71.8980 7.2685 144.4420 211.2952 7.3669 15.5397 16.6128 20.8123 12.1712 102.5180 26.4280 131.1518 557.5612 2.1583 1.4029 2.4033 52.8971
temp: 298.150 k
press: 1.00000 atm
elementType: 16 8 8 8 6 6 6 6 6 6 6 1 1 1 1
symmnumber: 1
zpe: 249816.6 jmol-1
zpe.correction: 0.095150 hartree
zpe.thermalcorrener: 0.104011 hartree
zpe.thermalcorrenthalpy: 0.104955 hartree
zpe.thermalcorrgfe: 0.061046 hartree
zpe.sumelectzpe: -892.099698 hartree
zpe.sumelectthermal: -892.090836 hartree
zpe.sumelectthermalent: -892.089892 hartree
zpe.sumelectthermalfe: -892.133802 hartree
dipole: 3.8566 0.4841 -0.0001
dipole: 3.8869
quadrupole: -80.2351 -61.6528 -72.0410
quadrupole: -10.5041 -0.0001 0.0009
quadrupole: -8.9255 9.6568 -0.7313 -10.5041 -0.0001 0.0009
hfenergy: -892.1948478 hartree
pointgroup: C01 [X(C7H4O3S1)]
dipole: -1.5280349 0.0602146 0.0000487 debye
dipolederiv: -0.3482606 0.1647779 -0.0000176 0.3728251 -0.4010329 0.0000273 -0.0000494 0.0000762 0.081124 -1.4510168 -0.0953869 0.0000191 -0.2304355 -0.5392978 0.0000435 -0.0000655 -0.000027 -0.1413752 -1.2800137 -0.5659706 0.0000153 -0.6584349 -0.3685886 -0.0000193 0.0000149 -0.0000231 -0.4279915 -1.4950835 0.4180763 -0.0001144 0.4709882 -0.560966 0.0000477 0.0002058 -0.0000778 -0.2680461 0.6828673 -0.0146983 -0.000005 -0.4510834 0.2596685 -0.0000163 0.0000825 -0.0000266 0.1356029 0.4020831 0.1384487 -0.0000071 0.343798 -0.2787472 0.0000206 0.0000202 0.0000237 -0.1496325 -0.4085537 -0.1611909 0.0000065 0.0718714 -0.0194297 -0.0000108 -0.0000304 -0.0000058 -0.2151125 0.1666416 -0.067908 0.0000096 -0.0612032 0.1434365 -0.0000149 -0.0000156 -0.0000246 -0.0710081 1.1969315 0.5276559 -0.0000076 0.7056314 0.4296761 0.0000009 -0.0000094 0.0000009 0.0966514 -0.2019132 -0.0285559 0.0000002 -0.3909527 -0.1499115 -0.0000124 0.0000194 -0.0000034 -0.1914962 2.2276946 -0.4683779 0.000117 -0.3256576 1.3377034 -0.0001155 -0.0001565 0.0000324 0.2097996 0.0664885 -0.0299874 -0.0000008 -0.0367262 -0.0237486 0.0000118 -0.0000032 0.0000122 0.2032903 0.1012775 -0.034341 0.0000024 0.0003678 -0.0353414 0.0000118 0.0000016 0.000015 0.1628114 -0.0164346 0.058522 -0.0000069 0.0472827 0.0709366 0.0000074 -0.0000062 0.0000083 0.1815924 0.3572922 0.1589361 -0.0000107 0.1417288 0.1356426 0.0000181 -0.0000083 0.0000198 0.39379 unknown
polarizability: 154.4522531|2.0104626|104.0996325|0.001674|-0.0042194|38.1885743 unknown
InChI: InChI=1S/C7H4O3S/c8-4-1-2-6-5(3-4)10-7(9)11-6/h1-3,8H
charge 0 multiplicity 1
15 atoms
S  1.988971 1.496269 -0.000088
O  1.412924 -1.158439 0.000077
O  -3.504897 -0.949863 -0.000044
O  3.707132 -0.704823 0.000013
C  0.176975 -0.474615 0.000009
C  0.257098 0.934112 -0.00007
C  -1.043578 -1.163456 0.000019
C  -0.923909 1.700317 -0.000136
C  -2.224057 -0.380633 -0.000044
C  -2.168427 1.036623 -0.00012
C  2.550511 -0.29131 0.000168
H  -1.059498 -2.258041 0.000078
H  -0.887624 2.793247 -0.000207
H  -3.10687 1.596753 -0.00017
H  -3.463452 -1.938141 0.000015
