program: Orca
programVersion: 5.0.2
elementType: Br F F O O O C C C C C C C C C C C C C C C C C C C C C C C C H H H H H H H H H H H H H H H H H H H H H H H
charge: 0
multiplicity: 1
keywords: wb97x-d3
keywords: def2-TZVPP
keywords: def2/J RIJCOSX
keywords: DEFGRID2
keywords: scfconv7
keywords: smallprint printgap noloewdin
keywords: NOSOSCF
formula: C24H23BrF2O3
InChI: InChI=1/C24H23BrF2O3/c1-23(2,19-11-13-21(14-12-19)30-24(25,26)27)17-28-16-18-7-6-10-22(15-18)29-20-8-4-3-5-9-20/h3-15H,16-17H2,1-2H3
53 atoms
Br 2.039249 -3.417725 0.986207
F  3.567222 -1.261557 0.50659
F  2.556568 -2.016368 -1.234413
O  -4.310186 1.104034 -0.928521
O  1.49428 -0.785716 0.286673
O  0.719211 2.150848 -0.93353
C  -4.12829 -1.271926 -0.501096
C  -4.71031 0.07448 -0.052185
C  -2.613986 -1.221696 -0.335894
C  -4.556284 -1.565511 -1.938172
C  -4.722401 -2.358954 0.403057
C  -2.06337 -1.106817 0.94319
C  -1.733226 -1.230174 -1.412917
C  -4.06197 2.35221 -0.316963
C  -0.699088 -1.001991 1.140714
C  -0.357967 -1.118137 -1.237598
C  0.14454 -1.007395 0.043816
C  -2.681219 2.414819 0.282971
C  -1.575979 2.312178 -0.556611
C  -2.483491 2.533469 1.653095
C  -0.293054 2.31706 -0.033203
C  -1.194356 2.532692 2.171231
C  -0.091471 2.412605 1.34075
C  2.407034 -1.732355 0.06548
C  1.973997 2.644838 -0.718482
C  3.032927 1.87148 -1.176201
C  2.207246 3.886627 -0.139326
C  4.332112 2.335647 -1.035807
C  3.513485 4.332245 0.005922
C  4.580763 3.561114 -0.43364
H  -5.80735 0.006246 -0.038189
H  -4.394536 0.279321 0.977714
H  -4.184047 -2.535778 -2.272722
H  -5.645863 -1.597776 -1.999171
H  -4.215237 -0.815582 -2.651576
H  -5.804367 -2.417047 0.268602
H  -4.537442 -2.174526 1.461994
H  -4.306303 -3.337611 0.159568
H  -2.70436 -1.081192 1.815117
H  -2.103859 -1.306804 -2.425637
H  -4.160626 3.104022 -1.103958
H  -4.817265 2.585606 0.443039
H  -0.296883 -0.897212 2.139944
H  0.28875 -1.086165 -2.103829
H  -1.709083 2.223356 -1.628981
H  -3.334524 2.621449 2.31752
H  -1.042359 2.60974 3.240243
H  0.90281 2.387323 1.767077
H  2.83954 0.91797 -1.650153
H  1.386896 4.508102 0.196316
H  5.153264 1.727749 -1.393149
H  3.692608 5.296318 0.464191
H  5.596049 3.915477 -0.314314
elementType: Br F O C H
totalener: -3928.11403679 hartree
nucrepener: 3645.31234178 hartree
electener: -7573.42637857 hartree
twoeener: 5115.30531725 hartree
cpcmener: -0.02402986 hartree
kineticenergy: 3918.79478953 hartree
xcener: -198.384367266282 hartree
chargesum: -0.0000000
charge: -0.073789 -0.152775 -0.163732 -0.378575 -0.277198 -0.322150 0.393412 -0.083923 -0.045516 -0.368164 -0.336105 -0.207438 -0.193618 0.067341 -0.185571 -0.111914 0.153056 0.105420 -0.403311 -0.226182 0.395173 -0.115933 -0.242019 0.447048 0.346571 -0.278385 -0.241885 -0.114236 -0.134758 -0.195404 0.106625 0.102399 0.111126 0.104067 0.094757 0.102335 0.101657 0.109064 0.138456 0.140884 0.104839 0.099330 0.148075 0.141664 0.125097 0.139297 0.155736 0.151830 0.140275 0.154554 0.156887 0.158573 0.157032
qa: -0.0738 -0.1528 -0.1637 -0.3786 -0.2772 -0.3221 0.3934 -0.0839 -0.0455 -0.3682 -0.3361 -0.2074 -0.1936 0.0673 -0.1856 -0.1119 0.1531 0.1054 -0.4033 -0.2262 0.3952 -0.1159 -0.2420 0.4470 0.3466 -0.2784 -0.2419 -0.1142 -0.1348 -0.1954 0.1066 0.1024 0.1111 0.1041 0.0948 0.1023 0.1017 0.1091 0.1385 0.1409 0.1048 0.0993 0.1481 0.1417 0.1251 0.1393 0.1557 0.1518 0.1403 0.1546 0.1569 0.1586 0.1570
va: 1.1879 1.1453 1.1311 1.9290 2.0585 2.0481 3.5532 3.9808 3.5999 3.9228 3.9207 3.9812 3.9543 3.8951 3.9891 4.0012 3.6799 3.4831 4.0888 3.9123 3.5210 3.8705 3.9101 4.5478 3.6424 3.9910 3.9426 3.8946 3.8779 3.9214 1.0037 0.9861 0.9996 1.0051 1.0137 1.0048 1.0021 1.0019 1.0051 0.9991 0.9919 0.9939 1.0062 1.0116 1.0302 1.0053 0.9907 1.0039 1.0228 0.9997 0.9908 0.9901 0.9908
dispcorr: -0.034979209 hartree
energy: -3928.149015997163
dipole: -61.78762 60.32746 -1.46016 49.18937 -48.69809 0.49128 -11.02916 11.98929 0.96013
magnitude: 1.81529 au
magnitude: 4.61409 debye
