program: Orca
programVersion: 5.0.2
elementType: Br F F O O O C C C C C C C C C C C C C C C C C C C C C C C C H H H H H H H H H H H H H H H H H H H H H H H
charge: 0
multiplicity: 1
keywords: wb97x-d3
keywords: def2-TZVPP
keywords: def2/J RIJCOSX
keywords: DEFGRID2
keywords: scfconv7
keywords: smallprint printgap noloewdin
keywords: NOSOSCF
formula: C24H23BrF2O3
InChI: InChI=1/C24H23BrF2O3/c1-23(2,19-11-13-21(14-12-19)30-24(25,26)27)17-28-16-18-7-6-10-22(15-18)29-20-8-4-3-5-9-20/h3-15H,16-17H2,1-2H3
53 atoms
Br 2.731209 -2.899058 -1.885632
F  2.283609 -3.858039 0.572199
F  3.984065 -2.537352 0.457917
O  -3.554247 0.627133 1.425214
O  2.036426 -1.649176 0.499084
O  0.196953 3.161284 -0.959544
C  -3.653209 -1.400454 0.154568
C  -4.042107 0.078644 0.223078
C  -2.135841 -1.510699 0.253514
C  -4.132035 -1.950126 -1.193289
C  -4.372156 -2.16682 1.264754
C  -1.330475 -0.925954 -0.725681
C  -1.497886 -2.15208 1.311333
C  -3.849948 1.986918 1.599988
C  0.051867 -0.982015 -0.662567
C  -0.113267 -2.226128 1.390744
C  0.647736 -1.64459 0.396131
C  -3.069572 2.907143 0.692664
C  -1.773347 2.583461 0.306352
C  -3.632772 4.105513 0.265896
C  -1.053721 3.461933 -0.492515
C  -2.902245 4.977222 -0.527937
C  -1.606875 4.664081 -0.909563
C  2.727048 -2.703918 0.065516
C  1.162503 2.658791 -0.135979
C  2.172143 1.927019 -0.750682
C  1.198783 2.895369 1.23283
C  3.213515 1.420679 0.010546
C  2.243013 2.37145 1.982905
C  3.251078 1.631617 1.382553
H  -3.639973 0.613284 -0.647382
H  -5.137101 0.170342 0.174537
H  -3.700827 -1.415396 -2.040459
H  -3.869993 -3.004027 -1.297598
H  -5.217974 -1.870043 -1.274987
H  -5.451732 -2.067209 1.138142
H  -4.128268 -1.804114 2.263319
H  -4.140008 -3.232696 1.230707
H  -1.777846 -0.399805 -1.559591
H  -2.072228 -2.607351 2.105813
H  -4.924403 2.179864 1.478649
H  -3.605219 2.219272 2.640465
H  0.649537 -0.502528 -1.42556
H  0.355014 -2.713317 2.23597
H  -1.329082 1.647198 0.622607
H  -4.647247 4.356258 0.552184
H  -3.344129 5.909111 -0.856121
H  -1.032823 5.337247 -1.533749
H  2.139242 1.758901 -1.820042
H  0.430642 3.48128 1.720165
H  3.99361 0.84754 -0.473423
H  2.265645 2.554199 3.049512
H  4.059459 1.226474 1.976565
elementType: Br F O C H
totalener: -3928.11559690 hartree
nucrepener: 3576.42369724 hartree
electener: -7504.53929414 hartree
twoeener: 5045.86881900 hartree
cpcmener: -0.02287685 hartree
kineticenergy: 3918.80190831 hartree
xcener: -198.383746245569 hartree
chargesum: -0.0000000
charge: -0.087550 -0.155755 -0.150161 -0.368154 -0.275513 -0.328337 0.393587 -0.092363 -0.042992 -0.333734 -0.370594 -0.245191 -0.169884 0.064707 -0.181392 -0.173656 0.216923 0.054234 -0.283094 -0.237611 0.337608 -0.105304 -0.268054 0.435927 0.319036 -0.266045 -0.201494 -0.132909 -0.149367 -0.179794 0.111950 0.110736 0.101930 0.109248 0.103341 0.102144 0.098596 0.109645 0.138040 0.145073 0.096401 0.106053 0.155405 0.149759 0.138335 0.139381 0.156856 0.143457 0.144382 0.153008 0.149269 0.158145 0.155775
qa: -0.0875 -0.1558 -0.1502 -0.3682 -0.2755 -0.3283 0.3936 -0.0924 -0.0430 -0.3337 -0.3706 -0.2452 -0.1699 0.0647 -0.1814 -0.1737 0.2169 0.0542 -0.2831 -0.2376 0.3376 -0.1053 -0.2681 0.4359 0.3190 -0.2660 -0.2015 -0.1329 -0.1494 -0.1798 0.1119 0.1107 0.1019 0.1092 0.1033 0.1021 0.0986 0.1096 0.1380 0.1451 0.0964 0.1061 0.1554 0.1498 0.1383 0.1394 0.1569 0.1435 0.1444 0.1530 0.1493 0.1581 0.1558
va: 1.1752 1.1401 1.1433 1.9297 2.0755 2.0761 3.5711 3.9332 3.6255 3.9245 3.9251 4.0304 3.9562 3.9013 4.0100 4.1165 3.6626 3.5799 3.9415 3.9753 3.6344 3.8763 4.0343 4.5666 3.6535 3.9255 3.8859 3.8395 3.9039 3.8861 0.9828 1.0035 1.0019 1.0026 1.0034 1.0065 1.0113 0.9994 1.0093 0.9970 0.9982 0.9891 0.9962 1.0061 1.0144 1.0028 0.9891 1.0078 1.0098 0.9988 0.9955 0.9901 0.9909
dispcorr: -0.032450271 hartree
energy: -3928.148047170608
dipole: -72.61590 70.51630 -2.09960 46.22087 -45.68195 0.53891 24.79211 -24.59471 0.19740
magnitude: 2.17663 au
magnitude: 5.53255 debye
