program: Orca
programVersion: 5.0.2
elementType: Br F F O O O C C C C C C C C C C C C C C C C C C C C C C C C H H H H H H H H H H H H H H H H H H H H H H H
charge: 0
multiplicity: 1
keywords: wb97x-d3
keywords: def2-TZVPP
keywords: def2/J RIJCOSX
keywords: DEFGRID2
keywords: scfconv7
keywords: smallprint printgap noloewdin
keywords: NOSOSCF
formula: C24H23BrF2O3
InChI: InChI=1/C24H23BrF2O3/c1-23(2,19-11-13-21(14-12-19)30-24(25,26)27)17-28-16-18-7-6-10-22(15-18)29-20-8-4-3-5-9-20/h3-15H,16-17H2,1-2H3
53 atoms
Br 1.950451 -3.522859 1.036944
F  3.547727 -1.405034 0.58674
F  2.5217 -2.10992 -1.165829
O  -4.211994 1.115414 -0.932085
O  1.490159 -0.869988 0.367148
O  0.858802 2.059255 -0.740297
C  -4.155453 -1.221737 -0.31945
C  -4.671496 0.181696 0.018878
C  -2.638261 -1.213095 -0.175274
C  -4.61445 -1.618849 -1.721935
C  -4.784685 -2.201804 0.677425
C  -2.063118 -1.059694 1.088563
C  -1.776649 -1.286231 -1.265527
C  -3.95384 2.405883 -0.421055
C  -0.692837 -0.985505 1.25936
C  -0.396247 -1.2040 -1.118416
C  0.13023 -1.057762 0.149782
C  -2.606644 2.474717 0.249896
C  -1.459683 2.298537 -0.520307
C  -2.480905 2.661843 1.620569
C  -0.209869 2.303391 0.075016
C  -1.222388 2.662193 2.211042
C  -0.080595 2.47466 1.45003
C  2.375212 -1.837624 0.138522
C  2.050737 2.700588 -0.561053
C  3.195838 1.987121 -0.891515
C  2.139784 4.021255 -0.136187
C  4.436062 2.598848 -0.790629
C  3.389367 4.615449 -0.028735
C  4.54143 3.91123 -0.350535
H  -5.770686 0.173103 0.031341
H  -4.346601 0.448691 1.032004
H  -4.283465 -2.627679 -1.975413
H  -5.705148 -1.613643 -1.767018
H  -4.256864 -0.946561 -2.501262
H  -5.869491 -2.223039 0.556281
H  -4.582472 -1.938056 1.716022
H  -4.414205 -3.214867 0.514466
H  -2.687482 -0.98164 1.969318
H  -2.16732 -1.394709 -2.267685
H  -3.98147 3.086348 -1.275535
H  -4.740834 2.729229 0.270692
H  -0.2689 -0.854352 2.246442
H  0.235221 -1.224058 -1.996023
H  -1.53662 2.155019 -1.592181
H  -3.364668 2.804598 2.23053
H  -1.128561 2.794677 3.281264
H  0.891575 2.456104 1.926039
H  3.112839 0.966155 -1.240951
H  1.250843 4.590058 0.105624
H  5.325285 2.039245 -1.051003
H  3.456888 5.64323 0.30417
H  5.511313 4.383026 -0.264306
elementType: Br F O C H
totalener: -3928.11475292 hartree
nucrepener: 3627.62809934 hartree
electener: -7555.74285227 hartree
twoeener: 5097.65525437 hartree
cpcmener: -0.02419790 hartree
kineticenergy: 3918.79900066 hartree
xcener: -198.384174205111 hartree
chargesum: 0.0000000
charge: -0.073494 -0.154063 -0.167069 -0.376897 -0.278159 -0.326551 0.391410 -0.089430 -0.022905 -0.364254 -0.337759 -0.216833 -0.204859 0.064931 -0.172719 -0.107259 0.134184 0.097793 -0.385075 -0.217259 0.363492 -0.113377 -0.224532 0.451248 0.322123 -0.259103 -0.219318 -0.127778 -0.146768 -0.187422 0.106687 0.103153 0.113308 0.103577 0.094593 0.102677 0.101436 0.109124 0.139125 0.141991 0.105958 0.099535 0.147988 0.143611 0.125832 0.140772 0.156297 0.151562 0.137079 0.153026 0.155873 0.158105 0.156394
qa: -0.0735 -0.1541 -0.1671 -0.3769 -0.2782 -0.3266 0.3914 -0.0894 -0.0229 -0.3643 -0.3378 -0.2168 -0.2049 0.0649 -0.1727 -0.1073 0.1342 0.0978 -0.3851 -0.2173 0.3635 -0.1134 -0.2245 0.4512 0.3221 -0.2591 -0.2193 -0.1278 -0.1468 -0.1874 0.1067 0.1032 0.1133 0.1036 0.0946 0.1027 0.1014 0.1091 0.1391 0.1420 0.1060 0.0995 0.1480 0.1436 0.1258 0.1408 0.1563 0.1516 0.1371 0.1530 0.1559 0.1581 0.1564
va: 1.1878 1.1446 1.1265 1.9292 2.0609 2.0337 3.5538 3.9891 3.5794 3.9187 3.9205 3.9867 3.9681 3.8971 3.9770 4.0078 3.6878 3.4884 4.0872 3.9047 3.5290 3.8688 3.9238 4.5389 3.6751 3.9937 3.9266 3.9106 3.8927 3.9113 1.0036 0.9847 0.9994 1.0049 1.0134 1.0046 1.0022 1.0017 1.0052 0.9989 0.9918 0.9939 1.0060 1.0127 1.0285 1.0048 0.9903 1.0030 1.0285 1.0001 0.9915 0.9906 0.9909
dispcorr: -0.034392727 hartree
energy: -3928.149145650770
dipole: -60.97934 59.38574 -1.59359 52.41334 -51.73465 0.67868 -10.16710 11.10882 0.94172
magnitude: 1.97155 au
magnitude: 5.01127 debye
