program: Orca
programVersion: 5.0.2
elementType: Br F F O O O C C C C C C C C C C C C C C C C C C C C C C C C H H H H H H H H H H H H H H H H H H H H H H H
charge: 0
multiplicity: 1
keywords: wb97x-d3
keywords: def2-TZVPP
keywords: def2/J RIJCOSX
keywords: DEFGRID2
keywords: scfconv7
keywords: smallprint printgap noloewdin
keywords: NOSOSCF
formula: C24H23BrF2O3
InChI: InChI=1/C24H23BrF2O3/c1-23(2,19-11-13-21(14-12-19)30-24(25,26)27)17-28-16-18-7-6-10-22(15-18)29-20-8-4-3-5-9-20/h3-15H,16-17H2,1-2H3
53 atoms
Br 1.925073 -1.550409 2.085664
F  3.289993 -1.773073 -0.214963
F  3.450812 -3.503711 1.039752
O  -3.400162 0.148992 0.565469
O  1.643808 -3.260728 -0.084044
O  0.920708 2.884723 0.704623
C  -3.424654 -1.061021 -1.501757
C  -3.557755 0.30611 -0.825166
C  -2.073818 -1.660733 -1.128288
C  -3.50537 -0.844325 -3.016815
C  -4.597487 -1.947526 -1.083819
C  -0.896267 -1.011674 -1.503968
C  -1.949626 -2.839349 -0.399273
C  -3.691052 1.297368 1.315002
C  0.356379 -1.501772 -1.171539
C  -0.705995 -3.345318 -0.047308
C  0.435853 -2.670838 -0.43176
C  -2.675612 2.404574 1.173903
C  -1.331877 2.117924 0.959662
C  -3.075537 3.731041 1.308052
C  -0.414362 3.15487 0.872475
C  -2.145679 4.757125 1.237531
C  -0.80634 4.476959 1.007615
C  2.593616 -2.598744 0.577796
C  1.364728 2.366558 -0.475554
C  2.647206 1.827691 -0.463395
C  0.624995 2.392943 -1.65195
C  3.187433 1.315832 -1.631447
C  1.17886 1.86775 -2.813017
C  2.456099 1.3271 -2.813315
H  -2.811977 1.002244 -1.231497
H  -4.546356 0.729466 -1.055573
H  -2.723146 -0.180512 -3.387147
H  -3.416255 -1.792111 -3.549615
H  -4.465619 -0.401063 -3.289209
H  -5.535983 -1.475119 -1.380145
H  -4.644077 -2.115221 -0.007699
H  -4.558001 -2.922626 -1.572535
H  -0.939787 -0.093196 -2.075304
H  -2.825514 -3.387362 -0.081484
H  -4.688579 1.68715 1.069955
H  -3.728333 0.977113 2.36026
H  1.238178 -0.970245 -1.504021
H  -0.630215 -4.259813 0.52708
H  -0.993763 1.092292 0.861702
H  -4.121572 3.962693 1.47085
H  -2.465931 5.785179 1.3470
H  -0.074799 5.27207 0.937497
H  3.214648 1.814236 0.458726
H  -0.369831 2.818323 -1.680463
H  4.187731 0.902714 -1.61539
H  0.598003 1.888948 -3.72642
H  2.878512 0.920423 -3.722589
elementType: Br F O C H
totalener: -3928.11598656 hartree
nucrepener: 3656.12769217 hartree
electener: -7584.24367874 hartree
twoeener: 5125.42312515 hartree
cpcmener: -0.02257972 hartree
kineticenergy: 3918.77790468 hartree
xcener: -198.380900645798 hartree
chargesum: 0.0000000
charge: -0.076744 -0.155370 -0.151590 -0.367813 -0.265956 -0.328879 0.380912 -0.080947 -0.017821 -0.334469 -0.369503 -0.267378 -0.190315 0.061551 -0.093658 -0.123457 0.090268 0.054622 -0.235402 -0.212390 0.251776 -0.126447 -0.218356 0.427264 0.346116 -0.257062 -0.237965 -0.121302 -0.155957 -0.180624 0.102168 0.111828 0.101454 0.109368 0.103484 0.102800 0.097210 0.109229 0.146128 0.143515 0.096007 0.107002 0.154204 0.147067 0.133828 0.139944 0.157465 0.145872 0.133897 0.151315 0.152870 0.157346 0.152896
qa: -0.0767 -0.1554 -0.1516 -0.3678 -0.2660 -0.3289 0.3809 -0.0809 -0.0178 -0.3345 -0.3695 -0.2674 -0.1903 0.0616 -0.0937 -0.1235 0.0903 0.0546 -0.2354 -0.2124 0.2518 -0.1264 -0.2184 0.4273 0.3461 -0.2571 -0.2380 -0.1213 -0.1560 -0.1806 0.1022 0.1118 0.1015 0.1094 0.1035 0.1028 0.0972 0.1092 0.1461 0.1435 0.0960 0.1070 0.1542 0.1471 0.1338 0.1399 0.1575 0.1459 0.1339 0.1513 0.1529 0.1573 0.1529
va: 1.1730 1.1266 1.1428 1.9306 2.1140 2.0763 3.5867 3.9289 3.6319 3.9277 3.9242 4.0326 3.9759 3.8941 3.9281 3.9998 3.8853 3.5426 3.9887 3.9550 3.7146 3.8868 4.0114 4.5547 3.6237 3.9616 3.8342 3.8439 3.8593 3.8610 0.9854 1.0026 1.0009 1.0030 1.0029 1.0063 1.0121 0.9996 0.9975 0.9975 0.9989 0.9898 1.0099 1.0046 1.0182 1.0025 0.9894 1.0045 1.0158 1.0049 0.9923 0.9924 0.9922
dispcorr: -0.033724689 hartree
energy: -3928.149711252647
dipole: -62.69655 60.50950 -2.18704 30.93725 -30.07882 0.85843 -40.32961 39.30986 -1.01976
magnitude: 2.56124 au
magnitude: 6.51016 debye
