program: Orca
programVersion: 5.0.2
elementType: Br F F O O O C C C C C C C C C C C C C C C C C C C C C C C C H H H H H H H H H H H H H H H H H H H H H H H
charge: 0
multiplicity: 1
keywords: wb97x-d3
keywords: def2-TZVPP
keywords: def2/J RIJCOSX
keywords: DEFGRID2
keywords: scfconv7
keywords: smallprint printgap noloewdin
keywords: NOSOSCF
formula: C24H23BrF2O3
InChI: InChI=1/C24H23BrF2O3/c1-23(2,19-11-13-21(14-12-19)30-24(25,26)27)17-28-16-18-7-6-10-22(15-18)29-20-8-4-3-5-9-20/h3-15H,16-17H2,1-2H3
53 atoms
Br 1.940454 -1.726815 1.970211
F  2.811064 -1.008266 -0.450681
F  3.593803 -2.898996 0.197375
O  -3.786964 0.087499 0.751878
O  1.585794 -2.864303 -0.537488
O  0.942435 2.048026 0.86326
C  -3.844399 -1.255565 -1.236912
C  -4.053224 0.132896 -0.629517
C  -2.396498 -1.681376 -1.017462
C  -4.132313 -1.151151 -2.73958
C  -4.845959 -2.236849 -0.627859
C  -1.358807 -0.935046 -1.579328
C  -2.046238 -2.805459 -0.275367
C  -3.838907 1.346513 1.376743
C  -0.028892 -1.289288 -1.422815
C  -0.71899 -3.17402 -0.097865
C  0.27854 -2.411744 -0.67164
C  -2.685247 2.237148 0.991495
C  -1.3839 1.743134 1.055242
C  -2.897277 3.539735 0.560766
C  -0.318699 2.556819 0.711968
C  -1.820239 4.349415 0.219098
C  -0.524754 3.867302 0.29252
C  2.491096 -2.160724 0.146736
C  1.83887 2.123918 -0.161919
C  3.182641 2.16369 0.188003
C  1.458642 2.112407 -1.498794
C  4.148823 2.182477 -0.805418
C  2.438207 2.138195 -2.482395
C  3.78382 2.172998 -2.145323
H  -3.403284 0.85973 -1.134439
H  -5.089061 0.456614 -0.810351
H  -3.986612 -2.114129 -3.231142
H  -5.166736 -0.84591 -2.910478
H  -3.49117 -0.423502 -3.238644
H  -4.763102 -3.225995 -1.081804
H  -5.862246 -1.882486 -0.810086
H  -4.732137 -2.354152 0.449759
H  -1.579234 -0.053795 -2.168467
H  -2.806471 -3.42328 0.181015
H  -4.78749 1.857936 1.165567
H  -3.814389 1.153562 2.452232
H  0.740244 -0.702502 -1.905107
H  -0.470114 -4.05652 0.477584
H  -1.192138 0.727448 1.382186
H  -3.906888 3.926418 0.49049
H  -1.992129 5.366177 -0.109863
H  0.312611 4.502756 0.032083
H  3.4666 2.168441 1.232943
H  0.414252 2.074855 -1.782182
H  5.194577 2.209786 -0.527059
H  2.139236 2.125774 -3.522757
H  4.540438 2.191526 -2.918656
elementType: Br F O C H
totalener: -3928.11581166 hartree
nucrepener: 3665.97087581 hartree
electener: -7594.08668746 hartree
twoeener: 5135.82978738 hartree
cpcmener: -0.02359926 hartree
kineticenergy: 3918.79984893 hartree
xcener: -198.381938849708 hartree
chargesum: -0.0000000
charge: -0.078653 -0.150477 -0.151298 -0.366968 -0.273023 -0.317846 0.399648 -0.088209 -0.048651 -0.334567 -0.370759 -0.248553 -0.169221 0.070696 -0.162945 -0.135953 0.143437 0.007279 -0.276447 -0.169930 0.254239 -0.144872 -0.178053 0.433187 0.357621 -0.276922 -0.245639 -0.107368 -0.150442 -0.193996 0.107234 0.106618 0.109494 0.103516 0.100905 0.109039 0.102660 0.098871 0.140995 0.144679 0.094917 0.109601 0.164845 0.146851 0.122908 0.140691 0.157525 0.155916 0.134725 0.154050 0.155434 0.157202 0.156007
qa: -0.0787 -0.1505 -0.1513 -0.3670 -0.2730 -0.3178 0.3996 -0.0882 -0.0487 -0.3346 -0.3708 -0.2486 -0.1692 0.0707 -0.1629 -0.1360 0.1434 0.0073 -0.2764 -0.1699 0.2542 -0.1449 -0.1781 0.4332 0.3576 -0.2769 -0.2456 -0.1074 -0.1504 -0.1940 0.1072 0.1066 0.1095 0.1035 0.1009 0.1090 0.1027 0.0989 0.1410 0.1447 0.0949 0.1096 0.1648 0.1469 0.1229 0.1407 0.1575 0.1559 0.1347 0.1541 0.1554 0.1572 0.1560
va: 1.1778 1.1325 1.1446 1.9296 2.1061 2.0540 3.5558 3.9543 3.6051 3.9243 3.9273 3.9991 3.9529 3.8869 3.9853 4.0114 3.8044 3.5884 4.0015 3.9070 3.7506 3.9140 3.9300 4.5467 3.5404 4.0033 3.8742 3.8729 3.9055 3.9115 0.9834 1.0039 1.0025 1.0036 1.0029 0.9995 1.0060 1.0109 1.0080 0.9976 0.9991 0.9901 0.9909 1.0057 1.0238 1.0029 0.9909 0.9968 1.0137 0.9992 0.9889 0.9910 0.9908
dispcorr: -0.033209937 hartree
energy: -3928.149021592494
dipole: -61.90565 60.03710 -1.86855 30.63504 -29.65574 0.97930 -35.39902 34.33334 -1.06568
magnitude: 2.36351 au
magnitude: 6.00757 debye
