program: Orca
programVersion: 5.0.2
elementType: Br F F O O O C C C C C C C C C C C C C C C C C C C C C C C C H H H H H H H H H H H H H H H H H H H H H H H
charge: 0
multiplicity: 1
keywords: wb97x-d3
keywords: def2-TZVPP
keywords: def2/J RIJCOSX
keywords: DEFGRID2
keywords: scfconv7
keywords: smallprint printgap noloewdin
keywords: NOSOSCF
formula: C24H23BrF2O3
InChI: InChI=1/C24H23BrF2O3/c1-23(2,19-11-13-21(14-12-19)30-24(25,26)27)17-28-16-18-7-6-10-22(15-18)29-20-8-4-3-5-9-20/h3-15H,16-17H2,1-2H3
53 atoms
Br 2.149056 -3.85297 -0.823515
F  3.648125 -1.679171 -0.34365
F  2.277863 -1.427169 -1.977624
O  -4.033029 0.858327 -0.822684
O  1.604062 -1.304372 0.137477
O  0.781721 1.977499 0.25993
C  -4.089342 -1.207868 0.41204
C  -4.444671 0.283025 0.395282
C  -2.573015 -1.326029 0.311487
C  -4.809483 -1.928733 -0.728761
C  -4.60369 -1.787487 1.733731
C  -1.763045 -1.020608 1.407319
C  -1.929798 -1.65328 -0.876477
C  -3.938877 2.262119 -0.790665
C  -0.383107 -1.047048 1.32252
C  -0.544104 -1.669266 -0.993223
C  0.221957 -1.36617 0.117521
C  -2.752893 2.744228 0.007733
C  -1.496389 2.194616 -0.231036
C  -2.892483 3.725212 0.98185
C  -0.401077 2.613435 0.507764
C  -1.787582 4.143199 1.712672
C  -0.537729 3.587084 1.49222
C  2.401234 -1.912189 -0.736077
C  1.97242 2.640768 0.366047
C  3.030672 1.951559 0.941731
C  2.153334 3.924615 -0.135645
C  4.280273 2.5504 1.010901
C  3.405506 4.515582 -0.047461
C  4.473136 3.835235 0.523027
H  -5.529952 0.404697 0.526918
H  -3.962631 0.775844 1.250019
H  -4.566292 -2.992859 -0.738241
H  -5.889409 -1.841779 -0.595198
H  -4.576598 -1.526442 -1.713959
H  -4.32371 -2.836854 1.837077
H  -5.693137 -1.731573 1.771883
H  -4.22609 -1.254795 2.607195
H  -2.203372 -0.744723 2.356429
H  -2.500332 -1.896651 -1.761548
H  -3.842006 2.58434 -1.830778
H  -4.858558 2.717981 -0.40118
H  0.222561 -0.805417 2.186771
H  -0.11579 -1.900456 -1.957485
H  -1.362736 1.430832 -0.988877
H  -3.866478 4.156445 1.179322
H  -1.902095 4.899592 2.47849
H  0.309776 3.906904 2.08496
H  2.877716 0.953081 1.330375
H  1.332896 4.461156 -0.595763
H  5.104344 2.007584 1.455657
H  3.545647 5.51563 -0.437406
H  5.447636 4.301652 0.582622
elementType: Br F O C H
totalener: -3928.11480921 hartree
nucrepener: 3559.44419755 hartree
electener: -7487.55900677 hartree
twoeener: 5029.34162023 hartree
cpcmener: -0.02237143 hartree
kineticenergy: 3918.78385575 hartree
xcener: -198.381691973761 hartree
chargesum: -0.0000000
charge: -0.079930 -0.151164 -0.158697 -0.366781 -0.256760 -0.313922 0.388655 -0.111933 -0.030459 -0.355720 -0.338840 -0.161467 -0.257365 0.066934 -0.268522 -0.122196 0.255971 0.050641 -0.330261 -0.197706 0.295599 -0.126512 -0.222858 0.430223 0.305431 -0.268214 -0.209478 -0.117210 -0.138860 -0.186813 0.105575 0.108885 0.115086 0.102041 0.093879 0.110686 0.102705 0.100907 0.142262 0.140652 0.107444 0.095269 0.147158 0.143116 0.139737 0.140192 0.157656 0.156710 0.142010 0.154525 0.156926 0.158104 0.156688
qa: -0.0799 -0.1512 -0.1587 -0.3668 -0.2568 -0.3139 0.3887 -0.1119 -0.0305 -0.3557 -0.3388 -0.1615 -0.2574 0.0669 -0.2685 -0.1222 0.2560 0.0506 -0.3303 -0.1977 0.2956 -0.1265 -0.2229 0.4302 0.3054 -0.2682 -0.2095 -0.1172 -0.1389 -0.1868 0.1056 0.1089 0.1151 0.1020 0.0939 0.1107 0.1027 0.1009 0.1423 0.1407 0.1074 0.0953 0.1472 0.1431 0.1397 0.1402 0.1577 0.1567 0.1420 0.1545 0.1569 0.1581 0.1567
va: 1.1771 1.1442 1.1306 1.9388 2.1289 2.0590 3.5656 4.0025 3.6172 3.9135 3.9168 3.9356 4.1223 3.8939 4.0245 3.9824 3.6715 3.5558 4.0385 3.9296 3.6894 3.9027 3.9501 4.5641 3.6777 3.9808 3.9378 3.8888 3.8922 3.9133 1.0028 0.9813 0.9995 1.0049 1.0133 1.0012 1.0045 1.0031 1.0011 1.0020 0.9904 0.9969 1.0038 1.0182 1.0143 1.0036 0.9904 0.9976 1.0221 0.9984 0.9908 0.9901 0.9905
dispcorr: -0.031960804 hartree
energy: -3928.146770016983
dipole: -63.81874 62.28140 -1.53734 58.17833 -57.13514 1.04318 19.79269 -18.88958 0.90311
magnitude: 2.06574 au
magnitude: 5.25068 debye
