program: Orca
programVersion: 5.0.2
elementType: Br F F O O O C C C C C C C C C C C C C C C C C C C C C C C C H H H H H H H H H H H H H H H H H H H H H H H
charge: 0
multiplicity: 1
keywords: wb97x-d3
keywords: def2-TZVPP
keywords: def2/J RIJCOSX
keywords: DEFGRID2
keywords: scfconv7
keywords: smallprint printgap noloewdin
keywords: NOSOSCF
formula: C24H23BrF2O3
InChI: InChI=1/C24H23BrF2O3/c1-23(2,19-11-13-21(14-12-19)30-24(25,26)27)17-28-16-18-7-6-10-22(15-18)29-20-8-4-3-5-9-20/h3-15H,16-17H2,1-2H3
53 atoms
Br 2.902812 -2.920812 -1.474116
F  2.293898 -3.758335 0.990368
F  3.981659 -2.4209 0.930296
O  -3.637014 0.959683 -0.887004
O  2.025284 -1.560959 0.789184
O  0.298516 2.988848 1.685809
C  -3.596116 -1.372943 -0.209091
C  -4.102371 0.046189 0.080508
C  -2.094425 -1.450329 0.048841
C  -3.920206 -1.782937 -1.649599
C  -4.383908 -2.294814 0.724291
C  -1.578578 -2.065573 1.188274
C  -1.179404 -0.875633 -0.837715
C  -4.00609 2.289942 -0.627698
C  -0.213942 -2.128795 1.433148
C  0.186611 -0.911858 -0.603006
C  0.656612 -1.557833 0.526288
C  -3.147731 2.969832 0.410002
C  -1.811362 2.61577 0.562989
C  -3.676773 4.003934 1.175424
C  -1.012611 3.317944 1.454907
C  -2.870949 4.690206 2.07189
C  -1.53209 4.35881 2.212002
C  2.759217 -2.625271 0.455999
C  1.140625 2.612287 0.673063
C  1.018971 3.070678 -0.633722
C  2.194478 1.781629 1.032934
C  1.954346 2.673305 -1.579456
C  3.130051 1.407246 0.080173
C  3.011184 1.842475 -1.232421
H  -5.201582 0.036841 0.07601
H  -3.786726 0.342209 1.090066
H  -4.992945 -1.696633 -1.832949
H  -3.410954 -1.181719 -2.40077
H  -3.639576 -2.823728 -1.818529
H  -4.042332 -3.327778 0.647795
H  -5.439853 -2.277416 0.452282
H  -4.314922 -1.992773 1.770674
H  -2.236614 -2.517124 1.916771
H  -1.519392 -0.379265 -1.735371
H  -3.905472 2.828317 -1.574189
H  -5.062411 2.360042 -0.338385
H  0.152687 -2.606375 2.332028
H  0.867695 -0.434658 -1.295699
H  -1.396074 1.798068 -0.012987
H  -4.72096 4.272332 1.070581
H  -3.285846 5.492894 2.66722
H  -0.897956 4.89289 2.907867
H  0.213178 3.732222 -0.92304
H  2.281829 1.436431 2.055462
H  1.854844 3.027697 -2.597092
H  3.948603 0.760206 0.366794
H  3.736004 1.540513 -1.976368
elementType: Br F O C H
totalener: -3928.09885089 hartree
nucrepener: 3582.53416196 hartree
electener: -7510.63301285 hartree
twoeener: 5052.18781523 hartree
cpcmener: -0.02451423 hartree
kineticenergy: 3918.77752061 hartree
xcener: -198.380674314975 hartree
chargesum: 0.0000000
charge: -0.082626 -0.156332 -0.151434 -0.388417 -0.278338 -0.338279 0.423610 -0.086153 -0.059125 -0.358716 -0.362550 -0.188697 -0.222197 0.071148 -0.161369 -0.183452 0.185591 0.029322 -0.255885 -0.239569 0.316419 -0.111465 -0.272237 0.439049 0.350704 -0.227623 -0.288288 -0.133077 -0.101200 -0.206869 0.109177 0.114078 0.103827 0.099375 0.108401 0.114915 0.105542 0.103980 0.149645 0.139690 0.107940 0.100446 0.153061 0.156787 0.151910 0.143466 0.160837 0.146930 0.157429 0.143925 0.161632 0.149563 0.155500
qa: -0.0826 -0.1563 -0.1514 -0.3884 -0.2783 -0.3383 0.4236 -0.0862 -0.0591 -0.3587 -0.3625 -0.1887 -0.2222 0.0711 -0.1614 -0.1835 0.1856 0.0293 -0.2559 -0.2396 0.3164 -0.1115 -0.2722 0.4390 0.3507 -0.2276 -0.2883 -0.1331 -0.1012 -0.2069 0.1092 0.1141 0.1038 0.0994 0.1084 0.1149 0.1055 0.1040 0.1496 0.1397 0.1079 0.1004 0.1531 0.1568 0.1519 0.1435 0.1608 0.1469 0.1574 0.1439 0.1616 0.1496 0.1555
va: 1.1804 1.1379 1.1426 1.9249 2.0717 2.0721 3.4832 3.9432 3.6626 3.9462 3.9227 3.9653 4.0353 3.8877 4.0899 3.9839 3.6973 3.5955 3.9250 3.9678 3.6726 3.8786 4.0118 4.5636 3.6081 3.8962 3.9431 3.8677 3.8055 3.8930 0.9980 0.9871 1.0016 1.0072 1.0004 0.9993 1.0064 0.9989 0.9956 1.0239 0.9897 0.9980 1.0050 0.9944 1.0155 1.0015 0.9879 1.0075 0.9964 1.0121 0.9887 1.0004 0.9929
dispcorr: -0.032833106 hartree
energy: -3928.131683992816
dipole: -74.98798 72.73832 -2.24965 46.47522 -46.04598 0.42924 12.15272 -12.31403 -0.16131
magnitude: 2.29591 au
magnitude: 5.83574 debye
