program: Orca
programVersion: 5.0.2
elementType: Br F F O O O C C C C C C C C C C C C C C C C C C C C C C C C H H H H H H H H H H H H H H H H H H H H H H H
charge: 0
multiplicity: 1
keywords: wb97x-d3
keywords: def2-TZVPP
keywords: def2/J RIJCOSX
keywords: DEFGRID2
keywords: scfconv7
keywords: smallprint printgap noloewdin
keywords: NOSOSCF
formula: C24H23BrF2O3
InChI: InChI=1/C24H23BrF2O3/c1-23(2,19-11-13-21(14-12-19)30-24(25,26)27)17-28-16-18-7-6-10-22(15-18)29-20-8-4-3-5-9-20/h3-15H,16-17H2,1-2H3
53 atoms
Br 1.868823 -3.782369 -0.939858
F  3.088803 -1.796491 0.374935
F  3.522833 -1.807818 -1.723382
O  -3.542392 1.3956 1.487585
O  1.626536 -1.022742 -1.12002
O  1.050795 2.323514 -0.886615
C  -3.65745 -0.971838 1.032826
C  -4.248957 0.412932 0.760127
C  -2.230501 -1.002429 0.498138
C  -4.527398 -1.995921 0.295261
C  -3.732461 -1.281869 2.528128
C  -1.994896 -0.93346 -0.877387
C  -1.119254 -1.054605 1.333618
C  -3.534955 2.666179 0.871496
C  -0.712875 -0.95744 -1.398301
C  0.178281 -1.061611 0.834679
C  0.365202 -1.033329 -0.533663
C  -2.554875 2.728812 -0.270748
C  -1.204159 2.500803 -0.014947
C  -2.977359 2.975927 -1.570512
C  -0.28689 2.562502 -1.052078
C  -2.052699 3.011208 -2.607236
C  -0.706302 2.812556 -2.354514
C  2.542928 -1.950554 -0.839374
C  1.714193 2.664979 0.261852
C  2.789065 1.858046 0.612557
C  1.403586 3.791231 1.015102
C  3.547914 2.171593 1.729918
C  2.165351 4.085338 2.138035
C  3.23511 3.280199 2.504608
H  -4.213038 0.614566 -0.317507
H  -5.308327 0.421294 1.050865
H  -4.133084 -3.004716 0.422118
H  -5.54325 -1.984147 0.694105
H  -4.597579 -1.796236 -0.774405
H  -3.180446 -0.574529 3.146339
H  -3.347962 -2.28019 2.74291
H  -4.773458 -1.254686 2.85427
H  -2.822279 -0.862374 -1.571678
H  -1.239339 -1.091324 2.407048
H  -4.535998 2.946575 0.523407
H  -3.251426 3.383115 1.645007
H  -0.553677 -0.917188 -2.468004
H  1.008781 -1.082973 1.526088
H  -0.880472 2.286331 0.996557
H  -4.028317 3.140726 -1.773411
H  -2.382251 3.199147 -3.620635
H  0.01874 2.847686 -3.157748
H  3.040058 1.000931 0.003271
H  0.582807 4.440362 0.739518
H  4.385021 1.538909 1.994513
H  1.918406 4.958865 2.727077
H  3.823216 3.518087 3.38069
elementType: Br F O C H
totalener: -3928.10026317 hartree
nucrepener: 3633.52275495 hartree
electener: -7561.62301813 hartree
twoeener: 5103.58571072 hartree
cpcmener: -0.02826987 hartree
kineticenergy: 3918.79002279 hartree
xcener: -198.383678839354 hartree
chargesum: -0.0000000
charge: -0.071006 -0.165444 -0.156531 -0.397196 -0.281885 -0.338292 0.410112 -0.093107 -0.029553 -0.338734 -0.367741 -0.220305 -0.208752 0.078036 -0.177554 -0.101276 0.128709 0.043773 -0.280811 -0.209378 0.327845 -0.108849 -0.280095 0.450869 0.325328 -0.276831 -0.218507 -0.130447 -0.152369 -0.186385 0.107917 0.110391 0.108772 0.104267 0.102857 0.094257 0.113718 0.105331 0.141385 0.146314 0.101437 0.110487 0.147593 0.149156 0.140281 0.144590 0.160413 0.145647 0.152959 0.159194 0.157429 0.161475 0.160504
qa: -0.0710 -0.1654 -0.1565 -0.3972 -0.2819 -0.3383 0.4101 -0.0931 -0.0296 -0.3387 -0.3677 -0.2203 -0.2088 0.0780 -0.1776 -0.1013 0.1287 0.0438 -0.2808 -0.2094 0.3278 -0.1088 -0.2801 0.4509 0.3253 -0.2768 -0.2185 -0.1304 -0.1524 -0.1864 0.1079 0.1104 0.1088 0.1043 0.1029 0.0943 0.1137 0.1053 0.1414 0.1463 0.1014 0.1105 0.1476 0.1492 0.1403 0.1446 0.1604 0.1456 0.1530 0.1592 0.1574 0.1615 0.1605
va: 1.1881 1.1287 1.1394 1.9090 2.0599 2.0358 3.5195 3.9942 3.5692 3.9205 3.9218 3.9714 3.9762 3.8851 3.9742 3.9373 3.6662 3.5859 3.9185 3.9039 3.5648 3.8777 4.0199 4.5363 3.6670 3.9262 3.9092 3.8961 3.8906 3.9061 0.9835 1.0039 1.0017 1.0043 1.0021 1.0125 0.9994 1.0045 1.0030 0.9983 0.9951 0.9914 1.0060 1.0132 1.0140 1.0033 0.9873 1.0080 1.0265 0.9966 0.9916 0.9895 0.9893
dispcorr: -0.034195761 hartree
energy: -3928.134458935258
dipole: -61.23653 59.11355 -2.12298 56.83933 -56.21783 0.62150 23.13527 -22.92055 0.21472
magnitude: 2.22248 au
magnitude: 5.64908 debye
