program: Orca
programVersion: 5.0.2
elementType: Br F F O O O C C C C C C C C C C C C C C C C C C C C C C C C H H H H H H H H H H H H H H H H H H H H H H H
charge: 0
multiplicity: 1
keywords: wb97x-d3
keywords: def2-TZVPP
keywords: def2/J RIJCOSX
keywords: DEFGRID2
keywords: scfconv7
keywords: smallprint printgap noloewdin
keywords: NOSOSCF
formula: C24H23BrF2O3
InChI: InChI=1/C24H23BrF2O3/c1-23(2,19-11-13-21(14-12-19)30-24(25,26)27)17-28-16-18-7-6-10-22(15-18)29-20-8-4-3-5-9-20/h3-15H,16-17H2,1-2H3
53 atoms
Br 2.031262 -3.464702 0.916231
F  2.602117 -1.051889 -0.114956
F  3.045298 -2.677715 -1.44412
O  -4.427529 0.850608 -0.81526
O  0.999512 -2.085289 -1.26302
O  0.466898 3.147215 0.736748
C  -4.178661 -0.922242 0.818037
C  -4.406808 0.573716 0.570903
C  -2.794097 -1.290502 0.30235
C  -5.289473 -1.731819 0.149181
C  -4.262556 -1.159722 2.329887
C  -2.593872 -2.110457 -0.803779
C  -1.660097 -0.753733 0.913624
C  -3.868856 2.097625 -1.18144
C  -1.319643 -2.38629 -1.280252
C  -0.379623 -0.999338 0.446591
C  -0.22414 -1.822778 -0.656856
C  -2.364925 2.035813 -1.233044
C  -1.591825 2.667816 -0.270029
C  -1.73831 1.286794 -2.228742
C  -0.206046 2.543276 -0.291962
C  -0.359043 1.17654 -2.247395
C  0.420838 1.796627 -1.278606
C  2.139595 -2.218147 -0.587315
C  1.806104 3.430146 0.599832
C  2.256649 4.277798 -0.40353
C  2.683718 2.893764 1.528634
C  3.60706 4.585881 -0.471161
C  4.031969 3.219645 1.4569
C  4.498203 4.061883 0.457486
H  -5.362492 0.872225 1.022784
H  -3.623905 1.147694 1.079634
H  -6.255784 -1.440178 0.563731
H  -5.340022 -1.585382 -0.929448
H  -5.164856 -2.800428 0.331774
H  -5.262186 -0.9214 2.697473
H  -3.555354 -0.5479 2.890971
H  -4.061816 -2.204737 2.569514
H  -3.43314 -2.554437 -1.320467
H  -1.761396 -0.097086 1.768152
H  -4.265058 2.331439 -2.171525
H  -4.196247 2.894852 -0.50481
H  -1.185181 -3.024088 -2.144261
H  0.454428 -0.520855 0.939077
H  -2.063694 3.252959 0.5111
H  -2.331335 0.792378 -2.988393
H  0.126416 0.591335 -3.017499
H  1.496348 1.679086 -1.297932
H  1.562444 4.694459 -1.122862
H  2.314415 2.235153 2.304648
H  3.962237 5.245499 -1.251945
H  4.71829 2.807899 2.18526
H  5.549138 4.312185 0.402464
elementType: Br F O C H
totalener: -3928.09845959 hartree
nucrepener: 3587.04570582 hartree
electener: -7515.14416542 hartree
twoeener: 5056.65566604 hartree
cpcmener: -0.02771549 hartree
kineticenergy: 3918.78156631 hartree
xcener: -198.382578964623 hartree
chargesum: -0.0000000
charge: -0.077393 -0.158112 -0.149968 -0.399625 -0.265506 -0.341661 0.408264 -0.087344 -0.055461 -0.365514 -0.342175 -0.186291 -0.271168 0.066189 -0.175596 -0.128373 0.185216 0.089115 -0.290778 -0.300294 0.324927 -0.103647 -0.218066 0.425390 0.262897 -0.177065 -0.230561 -0.154665 -0.139557 -0.168957 0.111462 0.107719 0.105338 0.094097 0.112534 0.104407 0.103454 0.108293 0.142896 0.145868 0.109436 0.102903 0.148130 0.156186 0.131727 0.142054 0.157675 0.147095 0.159520 0.149022 0.162447 0.161484 0.162027
qa: -0.0774 -0.1581 -0.1500 -0.3996 -0.2655 -0.3417 0.4083 -0.0873 -0.0555 -0.3655 -0.3422 -0.1863 -0.2712 0.0662 -0.1756 -0.1284 0.1852 0.0891 -0.2908 -0.3003 0.3249 -0.1036 -0.2181 0.4254 0.2629 -0.1771 -0.2306 -0.1547 -0.1396 -0.1690 0.1115 0.1077 0.1053 0.0941 0.1125 0.1044 0.1035 0.1083 0.1429 0.1459 0.1094 0.1029 0.1481 0.1562 0.1317 0.1421 0.1577 0.1471 0.1595 0.1490 0.1624 0.1615 0.1620
va: 1.1784 1.1281 1.1440 1.9074 2.0863 2.0512 3.5281 3.9607 3.5900 3.9170 3.9211 3.9643 4.0917 3.8902 4.0295 3.8936 3.6694 3.5015 3.9885 3.9566 3.6279 3.8217 3.8547 4.5729 3.6843 3.9229 3.9919 3.8836 3.8818 3.8836 1.0048 0.9870 1.0050 1.0132 0.9989 1.0040 1.0014 1.0018 0.9975 1.0024 0.9912 0.9946 1.0047 1.0031 1.0197 1.0085 0.9918 1.0097 0.9961 1.0050 0.9892 0.9883 0.9889
dispcorr: -0.033220222 hartree
energy: -3928.131679817090
dipole: -59.36582 58.65206 -0.71376 52.73139 -52.01961 0.71177 -4.37580 4.81095 0.43515
magnitude: 1.09792 au
magnitude: 2.79069 debye
