program: Orca
programVersion: 5.0.2
elementType: Br F F O O O C C C C C C C C C C C C C C C C C C C C C C C C H H H H H H H H H H H H H H H H H H H H H H H
charge: 0
multiplicity: 1
keywords: wb97x-d3
keywords: def2-TZVPP
keywords: def2/J RIJCOSX
keywords: DEFGRID2
keywords: scfconv7
keywords: smallprint printgap noloewdin
keywords: NOSOSCF
formula: C24H23BrF2O3
InChI: InChI=1/C24H23BrF2O3/c1-23(2,19-11-13-21(14-12-19)30-24(25,26)27)17-28-16-18-7-6-10-22(15-18)29-20-8-4-3-5-9-20/h3-15H,16-17H2,1-2H3
53 atoms
Br 1.448549 -0.337571 -2.241558
F  3.183292 -2.389126 -2.353499
F  3.182812 -1.359059 -0.473487
O  -3.260099 0.483638 0.567072
O  1.584174 -2.813652 -0.987007
O  1.158724 2.819235 -0.05024
C  -3.377927 -1.682567 1.585037
C  -4.060684 -0.671432 0.656888
C  -2.024506 -2.019558 0.969849
C  -4.270655 -2.924783 1.664308
C  -3.255402 -1.097638 2.992331
C  -0.82207 -1.565642 1.504914
C  -1.964676 -2.750415 -0.218526
C  -3.475725 1.262223 -0.585355
C  0.397453 -1.809319 0.883785
C  -0.763291 -2.999442 -0.858003
C  0.407528 -2.514312 -0.304477
C  -2.437069 2.347527 -0.626985
C  -1.110843 2.050401 -0.32456
C  -2.786915 3.649381 -0.967254
C  -0.161834 3.062034 -0.328827
C  -1.820941 4.645438 -1.002923
C  -0.505855 4.362651 -0.669109
C  2.390236 -1.845293 -1.436121
C  1.521724 2.057905 1.028448
C  0.738604 1.924568 2.169828
C  2.770979 1.45502 0.957966
C  1.21273 1.166838 3.232274
C  3.234925 0.710682 2.031494
C  2.456906 0.55437 3.170956
H  -4.203449 -1.121477 -0.334649
H  -5.058828 -0.424494 1.044715
H  -3.807651 -3.697814 2.278866
H  -5.229986 -2.671547 2.118832
H  -4.481157 -3.357044 0.685894
H  -2.769843 -1.801753 3.670343
H  -4.250636 -0.893032 3.390656
H  -2.694149 -0.164131 3.027347
H  -0.808614 -1.003857 2.428431
H  -2.870618 -3.121954 -0.679217
H  -3.401592 0.637025 -1.485863
H  -4.47932 1.705578 -0.591359
H  1.308638 -1.447319 1.341821
H  -0.738675 -3.557749 -1.784676
H  -0.820369 1.036782 -0.074394
H  -3.817945 3.887688 -1.196922
H  -2.097709 5.657379 -1.267502
H  0.246834 5.140732 -0.670808
H  -0.229243 2.402232 2.245203
H  3.376119 1.575583 0.069122
H  0.598649 1.062564 4.117276
H  4.2096 0.244461 1.971462
H  2.817763 -0.034944 4.003231
elementType: Br F O C H
totalener: -3928.09923345 hartree
nucrepener: 3735.47954250 hartree
electener: -7663.57877595 hartree
twoeener: 5205.40326183 hartree
cpcmener: -0.02618628 hartree
kineticenergy: 3918.77555974 hartree
xcener: -198.382520053008 hartree
chargesum: 0.0000000
charge: -0.075225 -0.153065 -0.152318 -0.379030 -0.275898 -0.332404 0.382451 -0.083705 -0.024904 -0.338840 -0.358669 -0.258451 -0.207734 0.081391 -0.103883 -0.146247 0.113437 -0.008174 -0.196999 -0.209795 0.304228 -0.119148 -0.254046 0.431875 0.357452 -0.218247 -0.274984 -0.176642 -0.121201 -0.179344 0.103965 0.110157 0.108846 0.105115 0.103234 0.114434 0.107051 0.089444 0.159818 0.145928 0.096568 0.093919 0.168782 0.150969 0.102869 0.142442 0.159300 0.146593 0.154122 0.138537 0.162949 0.155002 0.158072
qa: -0.0752 -0.1531 -0.1523 -0.3790 -0.2759 -0.3324 0.3825 -0.0837 -0.0249 -0.3388 -0.3587 -0.2585 -0.2077 0.0814 -0.1039 -0.1462 0.1134 -0.0082 -0.1970 -0.2098 0.3042 -0.1191 -0.2540 0.4319 0.3575 -0.2182 -0.2750 -0.1766 -0.1212 -0.1793 0.1040 0.1102 0.1088 0.1051 0.1032 0.1144 0.1071 0.0894 0.1598 0.1459 0.0966 0.0939 0.1688 0.1510 0.1029 0.1424 0.1593 0.1466 0.1541 0.1385 0.1629 0.1550 0.1581
va: 1.1764 1.1413 1.1272 1.9286 2.1032 2.0643 3.5688 3.9598 3.6370 3.9179 3.9206 3.9644 4.0054 3.8901 3.8900 4.0119 3.8355 3.7485 3.9075 3.9373 3.6366 3.8917 4.0192 4.5424 3.5867 3.8511 3.9390 3.8510 3.8582 3.8603 0.9919 1.0019 1.0015 1.0032 1.0026 0.9996 1.0052 1.0123 0.9888 1.0007 0.9913 0.9942 1.0028 1.0025 1.0243 1.0045 0.9884 1.0065 0.9998 1.0167 0.9895 0.9922 0.9903
dispcorr: -0.035095398 hartree
energy: -3928.134328848014
dipole: -55.61187 53.21517 -2.39670 6.70346 -7.07624 -0.37277 46.87478 -46.37554 0.49925
magnitude: 2.47636 au
magnitude: 6.29441 debye
