program: Orca
programVersion: 5.0.2
elementType: Br F F O O O C C C C C C C C C C C C C C C C C C C C C C C C H H H H H H H H H H H H H H H H H H H H H H H
charge: 0
multiplicity: 1
keywords: wb97x-d3
keywords: def2-TZVPP
keywords: def2/J RIJCOSX
keywords: DEFGRID2
keywords: scfconv7
keywords: smallprint printgap noloewdin
keywords: NOSOSCF
formula: C24H23BrF2O3
InChI: InChI=1/C24H23BrF2O3/c1-23(2,19-11-13-21(14-12-19)30-24(25,26)27)17-28-16-18-7-6-10-22(15-18)29-20-8-4-3-5-9-20/h3-15H,16-17H2,1-2H3
53 atoms
Br 2.018824 -3.88869 -0.126736
F  3.671355 -1.80156 0.260207
F  2.54341 -1.695511 -1.564696
O  -4.106913 0.7554 1.121711
O  1.624439 -1.192343 0.402028
O  0.68717 2.003611 0.353932
C  -4.036898 -1.213406 -0.265136
C  -4.427502 0.265448 -0.162889
C  -2.523586 -1.305117 -0.112983
C  -4.481295 -1.716433 -1.642125
C  -4.785972 -2.02537 0.791888
C  -1.6895 -0.853625 -1.137513
C  -1.917207 -1.742748 1.061283
C  -4.082522 2.159794 1.210541
C  -0.310754 -0.828554 -1.006393
C  -0.537063 -1.729349 1.213322
C  0.251995 -1.270649 0.17789
C  -2.840456 2.775397 0.613829
C  -1.608185 2.147847 0.756948
C  -2.908712 3.997887 -0.046725
C  -0.464108 2.729037 0.228045
C  -1.756524 4.577438 -0.558564
C  -0.525774 3.948457 -0.436259
C  2.465938 -1.99145 -0.261691
C  1.913862 2.6137 0.35457
C  2.891851 2.081585 -0.47294
C  2.199678 3.676394 1.2027
C  4.171292 2.619611 -0.448497
C  3.480095 4.210341 1.209667
C  4.469956 3.686599 0.387355
H  -3.905032 0.833343 -0.943777
H  -5.504854 0.374267 -0.351366
H  -4.16966 -2.750262 -1.795652
H  -5.569013 -1.682413 -1.721191
H  -4.079507 -1.120626 -2.461782
H  -4.530346 -3.084566 0.726239
H  -5.861394 -1.937082 0.626801
H  -4.589487 -1.70047 1.812925
H  -2.112246 -0.484117 -2.06239
H  -2.511326 -2.100537 1.890283
H  -4.972464 2.605598 0.748792
H  -4.12809 2.400139 2.276078
H  0.295512 -0.43726 -1.811653
H  -0.08726 -2.061318 2.1401
H  -1.523705 1.199236 1.274257
H  -3.864192 4.493964 -0.16692
H  -1.815144 5.525804 -1.076708
H  0.35941 4.403262 -0.861442
H  2.657232 1.250382 -1.125856
H  1.437102 4.080976 1.856492
H  4.934402 2.202651 -1.092626
H  3.705066 5.037073 1.87061
H  5.467113 4.105689 0.401773
elementType: Br F O C H
totalener: -3928.10060377 hartree
nucrepener: 3569.40918256 hartree
electener: -7497.50978633 hartree
twoeener: 5039.69510387 hartree
cpcmener: -0.02763272 hartree
kineticenergy: 3918.78624561 hartree
xcener: -198.381427248001 hartree
chargesum: 0.0000000
charge: -0.071765 -0.153749 -0.163013 -0.387248 -0.288864 -0.319057 0.403477 -0.105499 -0.023223 -0.340076 -0.359625 -0.199169 -0.223177 0.074157 -0.166595 -0.129495 0.132871 0.051660 -0.336141 -0.216187 0.319457 -0.134752 -0.234369 0.447509 0.303765 -0.257025 -0.216651 -0.128497 -0.137382 -0.186770 0.114922 0.110266 0.109999 0.104038 0.102840 0.115408 0.104815 0.092587 0.144820 0.144197 0.100181 0.107263 0.149854 0.151796 0.143629 0.143311 0.160807 0.156019 0.144652 0.159705 0.160961 0.162358 0.161008
qa: -0.0718 -0.1537 -0.1630 -0.3872 -0.2889 -0.3191 0.4035 -0.1055 -0.0232 -0.3401 -0.3596 -0.1992 -0.2232 0.0742 -0.1666 -0.1295 0.1329 0.0517 -0.3361 -0.2162 0.3195 -0.1348 -0.2344 0.4475 0.3038 -0.2570 -0.2167 -0.1285 -0.1374 -0.1868 0.1149 0.1103 0.1100 0.1040 0.1028 0.1154 0.1048 0.0926 0.1448 0.1442 0.1002 0.1073 0.1499 0.1518 0.1436 0.1433 0.1608 0.1560 0.1447 0.1597 0.1610 0.1624 0.1610
va: 1.1879 1.1438 1.1321 1.9217 2.0615 2.0592 3.5467 3.9733 3.5609 3.9189 3.9160 3.9901 4.0083 3.8846 3.9959 4.0198 3.6965 3.5608 4.0207 3.9495 3.7105 3.9050 3.9394 4.5434 3.6476 3.9865 3.9537 3.8847 3.8821 3.9027 0.9816 1.0029 1.0013 1.0040 1.0028 0.9989 1.0045 1.0133 1.0038 0.9987 0.9971 0.9899 1.0052 1.0030 1.0145 1.0017 0.9895 0.9987 1.0147 0.9966 0.9897 0.9886 0.9891
dispcorr: -0.032336959 hartree
energy: -3928.132940731637
dipole: -62.51493 60.87868 -1.63625 59.40699 -58.24052 1.16647 1.95946 -2.54400 -0.58454
magnitude: 2.09276 au
magnitude: 5.31938 debye
