program: Orca
programVersion: 5.0.2
elementType: Br F F O O O C C C C C C C C C C C C C C C C C C C C C C C C H H H H H H H H H H H H H H H H H H H H H H H
charge: 0
multiplicity: 1
keywords: wb97x-d3
keywords: def2-TZVPP
keywords: def2/J RIJCOSX
keywords: DEFGRID2
keywords: scfconv7
keywords: smallprint printgap noloewdin
keywords: NOSOSCF
formula: C24H23BrF2O3
InChI: InChI=1/C24H23BrF2O3/c1-23(2,19-11-13-21(14-12-19)30-24(25,26)27)17-28-16-18-7-6-10-22(15-18)29-20-8-4-3-5-9-20/h3-15H,16-17H2,1-2H3
53 atoms
Br 3.820596 -2.176506 1.011304
F  1.425461 -3.110307 1.770521
F  1.701441 -1.018332 2.159652
O  -3.95462 1.300689 -1.196175
O  1.383051 -1.68895 0.062227
O  1.074321 1.566769 0.36737
C  -4.16425 -1.106391 -1.170501
C  -4.631815 0.226061 -0.577018
C  -2.68886 -1.288306 -0.837471
C  -4.433492 -1.126323 -2.675247
C  -4.998426 -2.219587 -0.52765
C  -1.685111 -1.231829 -1.799924
C  -2.288655 -1.473639 0.484961
C  -3.719125 2.408793 -0.351978
C  -0.346592 -1.369746 -1.462581
C  -0.957904 -1.612683 0.85005
C  0.009463 -1.564504 -0.140954
C  -2.546695 2.177978 0.565532
C  -1.278614 2.005474 0.013949
C  -2.71401 2.094881 1.942104
C  -0.190525 1.782284 0.843165
C  -1.618609 1.856129 2.76329
C  -0.3534 1.706027 2.221944
C  1.913729 -1.978328 1.250571
C  1.514834 2.18761 -0.771007
C  1.255792 3.528033 -1.031636
C  2.303958 1.438344 -1.632902
C  1.785981 4.109855 -2.173961
C  2.836898 2.03714 -2.765545
C  2.575587 3.371101 -3.045522
H  -5.71485 0.332289 -0.725952
H  -4.460233 0.218938 0.505925
H  -4.130984 -2.076999 -3.117074
H  -5.502524 -1.006175 -2.857393
H  -3.920548 -0.332172 -3.216873
H  -4.678494 -3.199056 -0.885132
H  -6.052336 -2.100849 -0.785504
H  -4.929041 -2.222374 0.560593
H  -1.927881 -1.080915 -2.84236
H  -3.025031 -1.506006 1.277685
H  -3.514806 3.256947 -1.008551
H  -4.610422 2.661494 0.233218
H  0.416359 -1.325433 -2.229449
H  -0.729863 -1.744971 1.897173
H  -1.15229 2.050277 -1.061504
H  -3.699262 2.219941 2.373653
H  -1.749827 1.790883 3.835411
H  0.503358 1.530853 2.85961
H  0.652244 4.117838 -0.353552
H  2.508172 0.398361 -1.413477
H  1.582699 5.152864 -2.377979
H  3.455487 1.451884 -3.433128
H  2.987177 3.833288 -3.932571
elementType: Br F O C H
totalener: -3928.09762366 hartree
nucrepener: 3653.80440280 hartree
electener: -7581.90202646 hartree
twoeener: 5124.14768250 hartree
cpcmener: -0.02757850 hartree
kineticenergy: 3918.80208404 hartree
xcener: -198.386051685280 hartree
chargesum: -0.0000000
charge: -0.041114 -0.160186 -0.158878 -0.399046 -0.258128 -0.335787 0.407970 -0.087742 -0.063222 -0.367736 -0.341162 -0.164868 -0.284899 0.071152 -0.225382 -0.168901 0.291973 0.051907 -0.266955 -0.219944 0.333625 -0.102585 -0.294100 0.418511 0.335242 -0.208504 -0.282699 -0.146614 -0.120629 -0.192891 0.110456 0.107024 0.112973 0.104797 0.093988 0.108374 0.104223 0.103005 0.144278 0.143501 0.110068 0.102333 0.146209 0.130257 0.139042 0.143828 0.159356 0.141078 0.155169 0.139432 0.161408 0.160360 0.160434
qa: -0.0411 -0.1602 -0.1589 -0.3990 -0.2581 -0.3358 0.4080 -0.0877 -0.0632 -0.3677 -0.3412 -0.1649 -0.2849 0.0712 -0.2254 -0.1689 0.2920 0.0519 -0.2670 -0.2199 0.3336 -0.1026 -0.2941 0.4185 0.3352 -0.2085 -0.2827 -0.1466 -0.1206 -0.1929 0.1105 0.1070 0.1130 0.1048 0.0940 0.1084 0.1042 0.1030 0.1443 0.1435 0.1101 0.1023 0.1462 0.1303 0.1390 0.1438 0.1594 0.1411 0.1552 0.1394 0.1614 0.1604 0.1604
va: 1.1875 1.1379 1.1323 1.9075 2.1383 2.0295 3.5239 3.9767 3.6283 3.9187 3.9189 3.9403 4.0790 3.8916 3.9798 3.9382 3.6135 3.5727 3.9272 3.8982 3.5355 3.8678 3.9980 4.5542 3.6401 3.9317 3.9713 3.8892 3.9017 3.9090 1.0041 0.9856 0.9994 1.0048 1.0130 1.0019 1.0039 1.0016 0.9974 1.0057 0.9914 0.9944 1.0044 1.0322 1.0167 1.0037 0.9875 1.0161 0.9988 1.0161 0.9894 0.9895 0.9894
dispcorr: -0.035136645 hartree
energy: -3928.132760307874
dipole: -83.12332 81.39578 -1.72754 36.34789 -35.79963 0.54826 -28.83779 28.76865 -0.06914
magnitude: 1.81377 au
magnitude: 4.61024 debye
