program: Orca
programVersion: 5.0.2
elementType: Br F F O O O C C C C C C C C C C C C C C C C C C C C C C C C H H H H H H H H H H H H H H H H H H H H H H H
charge: 0
multiplicity: 1
keywords: wb97x-d3
keywords: def2-TZVPP
keywords: def2/J RIJCOSX
keywords: DEFGRID2
keywords: scfconv7
keywords: smallprint printgap noloewdin
keywords: NOSOSCF
formula: C24H23BrF2O3
InChI: InChI=1/C24H23BrF2O3/c1-23(2,19-11-13-21(14-12-19)30-24(25,26)27)17-28-16-18-7-6-10-22(15-18)29-20-8-4-3-5-9-20/h3-15H,16-17H2,1-2H3
53 atoms
Br 2.224331 -3.155375 1.050705
F  2.2790 -0.470872 1.235303
F  3.566019 -1.260278 -0.291275
O  -4.40282 1.049694 -0.834802
O  1.47916 -1.153771 -0.724596
O  0.646762 2.092132 -1.098482
C  -4.216222 -1.339533 -0.476629
C  -4.711201 0.005317 0.065451
C  -2.694147 -1.318955 -0.536447
C  -4.850895 -1.612674 -1.839937
C  -4.690136 -2.427176 0.494083
C  -1.950341 -1.222932 0.639099
C  -1.984729 -1.361547 -1.733567
C  -4.093307 2.284918 -0.218868
C  -0.565061 -1.165827 0.642058
C  -0.598732 -1.321447 -1.757199
C  0.103025 -1.224701 -0.570254
C  -2.683793 2.296586 0.309979
C  -1.623757 2.250189 -0.590391
C  -2.418218 2.290579 1.674024
C  -0.31704 2.189885 -0.132383
C  -1.106369 2.221473 2.124934
C  -0.047939 2.159067 1.232629
C  2.358126 -1.371767 0.248096
C  1.933283 2.516185 -0.897112
C  2.926994 1.790261 -1.540888
C  2.253702 3.649456 -0.159048
C  4.25141 2.183318 -1.420639
C  3.584859 4.024661 -0.039386
C  4.589091 3.294818 -0.660391
H  -5.798099 -0.044821 0.215803
H  -4.264779 0.185046 1.050503
H  -5.937927 -1.616941 -1.744766
H  -4.592592 -0.86815 -2.59247
H  -4.552393 -2.588962 -2.225576
H  -4.327942 -3.408236 0.184671
H  -5.780665 -2.467547 0.516142
H  -4.350414 -2.253734 1.515694
H  -2.449965 -1.171122 1.598068
H  -2.501651 -1.432878 -2.680062
H  -4.212433 3.050231 -0.988591
H  -4.802475 2.519332 0.583007
H  -0.059504 -1.061058 1.590213
H  -0.067636 -1.360326 -2.699579
H  -1.812986 2.258584 -1.657958
H  -3.235226 2.332283 2.383716
H  -0.901217 2.199738 3.187168
H  0.964023 2.083761 1.606076
H  2.661554 0.931109 -2.142473
H  1.484681 4.239792 0.321476
H  5.02099 1.612278 -1.923286
H  3.833675 4.901699 0.543575
H  5.623676 3.59346 -0.558273
elementType: Br F O C H
totalener: -3928.09855008 hartree
nucrepener: 3674.91230996 hartree
electener: -7603.01086004 hartree
twoeener: 5145.03188272 hartree
cpcmener: -0.02795620 hartree
kineticenergy: 3918.79305943 hartree
xcener: -198.387828643962 hartree
chargesum: -0.0000000
charge: -0.079897 -0.161469 -0.150483 -0.399375 -0.262356 -0.334460 0.408915 -0.087859 -0.066731 -0.367358 -0.341174 -0.304671 -0.176607 0.074111 -0.119677 -0.187412 0.226453 0.110965 -0.401473 -0.234997 0.423046 -0.120061 -0.262321 0.449667 0.342798 -0.290761 -0.233182 -0.122048 -0.148665 -0.189358 0.110491 0.107934 0.105524 0.093229 0.111782 0.108191 0.104146 0.103715 0.143609 0.143704 0.107806 0.102940 0.144043 0.147952 0.125565 0.144413 0.159458 0.149530 0.148928 0.160105 0.160449 0.162013 0.160915
qa: -0.0799 -0.1615 -0.1505 -0.3994 -0.2624 -0.3345 0.4089 -0.0879 -0.0667 -0.3674 -0.3412 -0.3047 -0.1766 0.0741 -0.1197 -0.1874 0.2265 0.1110 -0.4015 -0.2350 0.4230 -0.1201 -0.2623 0.4497 0.3428 -0.2908 -0.2332 -0.1220 -0.1487 -0.1894 0.1105 0.1079 0.1055 0.0932 0.1118 0.1082 0.1041 0.1037 0.1436 0.1437 0.1078 0.1029 0.1440 0.1480 0.1256 0.1444 0.1595 0.1495 0.1489 0.1601 0.1604 0.1620 0.1609
va: 1.1783 1.1293 1.1469 1.9078 2.1188 2.0387 3.5261 3.9670 3.6232 3.9204 3.9208 4.1334 3.9426 3.8864 3.9092 4.0127 3.6491 3.4589 4.0916 3.9078 3.4526 3.8844 3.8967 4.5295 3.6205 3.9437 3.9200 3.8874 3.8853 3.9087 1.0051 0.9848 1.0050 1.0133 0.9994 1.0022 1.0041 1.0013 1.0053 0.9976 0.9918 0.9940 1.0166 1.0042 1.0300 1.0039 0.9894 1.0108 1.0192 0.9971 0.9897 0.9892 0.9892
dispcorr: -0.035399705 hartree
energy: -3928.133949785529
dipole: -63.97397 62.68286 -1.29112 42.19196 -41.88121 0.31075 -14.20494 15.31749 1.11255
magnitude: 1.73243 au
magnitude: 4.40349 debye
