program: Orca
programVersion: 5.0.2
elementType: Br F F O O O C C C C C C C C C C C C C C C C C C C C C C C C H H H H H H H H H H H H H H H H H H H H H H H
charge: 0
multiplicity: 1
keywords: wb97x-d3
keywords: def2-TZVPP
keywords: def2/J RIJCOSX
keywords: DEFGRID2
keywords: scfconv7
keywords: smallprint printgap noloewdin
keywords: NOSOSCF
formula: C24H23BrF2O3
InChI: InChI=1/C24H23BrF2O3/c1-23(2,19-11-13-21(14-12-19)30-24(25,26)27)17-28-16-18-7-6-10-22(15-18)29-20-8-4-3-5-9-20/h3-15H,16-17H2,1-2H3
53 atoms
Br 2.001258 -1.401274 2.063725
F  3.279763 -1.732242 -0.267082
F  3.545955 -3.375524 1.085047
O  -3.262505 0.546144 -0.236881
O  1.691439 -3.260248 0.024305
O  0.926967 3.146359 0.752273
C  -3.465455 -1.423651 -1.593941
C  -4.053254 -0.597254 -0.445433
C  -2.070928 -1.888729 -1.18689
C  -3.441723 -0.59536 -2.881377
C  -4.407213 -2.611038 -1.819566
C  -1.902256 -3.027218 -0.398371
C  -0.921725 -1.180318 -1.536209
C  -3.621447 1.296523 0.897473
C  -0.648873 -3.448716 0.012589
C  0.346392 -1.586771 -1.141408
C  0.46737 -2.725913 -0.365753
C  -2.663185 2.445395 1.031086
C  -1.302378 2.243942 0.820562
C  -3.122039 3.713688 1.370556
C  -0.425649 3.313174 0.925738
C  -2.230211 4.768775 1.500847
C  -0.876612 4.57979 1.266107
C  2.644451 -2.526132 0.603352
C  1.40816 2.510883 -0.362848
C  0.722519 2.467554 -1.571325
C  2.672173 1.945661 -0.248159
C  1.313605 1.843504 -2.662018
C  3.254685 1.340002 -1.350309
C  2.577686 1.278896 -2.561483
H  -5.086741 -0.313343 -0.691402
H  -4.094757 -1.211993 0.465267
H  -3.026302 -1.173906 -3.708134
H  -4.459842 -0.313474 -3.154826
H  -2.865757 0.325137 -2.79984
H  -4.618949 -3.163682 -0.903738
H  -3.991491 -3.311056 -2.545407
H  -5.363431 -2.258942 -2.208924
H  -2.757189 -3.610893 -0.085959
H  -0.987382 -0.290486 -2.146718
H  -4.648629 1.674589 0.817294
H  -3.586604 0.668812 1.798867
H  -0.541564 -4.337863 0.620221
H  1.204398 -1.01116 -1.46205
H  -0.92348 1.259863 0.570324
H  -4.180902 3.878946 1.526276
H  -2.593491 5.753238 1.764504
H  -0.178553 5.403222 1.345817
H  -0.256379 2.916321 -1.677631
H  3.196725 1.98864 0.697652
H  0.776709 1.80957 -3.601113
H  4.243485 0.910869 -1.25771
H  3.030738 0.798566 -3.41828
elementType: Br F O C H
totalener: -3928.09995265 hartree
nucrepener: 3631.22091222 hartree
electener: -7559.32086487 hartree
twoeener: 5101.02411906 hartree
cpcmener: -0.02616366 hartree
kineticenergy: 3918.76628594 hartree
xcener: -198.377313527981 hartree
chargesum: 0.0000000
charge: -0.075561 -0.154009 -0.152011 -0.374652 -0.268070 -0.340016 0.356976 -0.077650 0.023585 -0.351667 -0.340573 -0.212014 -0.313358 0.088936 -0.147233 -0.066833 0.094419 0.005687 -0.209310 -0.217201 0.270522 -0.119698 -0.249823 0.426717 0.335268 -0.212921 -0.260373 -0.171190 -0.128689 -0.169821 0.106839 0.106261 0.115651 0.103666 0.089056 0.100891 0.115216 0.103765 0.150491 0.160788 0.091494 0.098066 0.150672 0.162245 0.138411 0.143454 0.160449 0.147862 0.154423 0.138314 0.161301 0.154467 0.156783
qa: -0.0756 -0.1540 -0.1520 -0.3747 -0.2681 -0.3400 0.3570 -0.0777 0.0236 -0.3517 -0.3406 -0.2120 -0.3134 0.0889 -0.1472 -0.0668 0.0944 0.0057 -0.2093 -0.2172 0.2705 -0.1197 -0.2498 0.4267 0.3353 -0.2129 -0.2604 -0.1712 -0.1287 -0.1698 0.1068 0.1063 0.1157 0.1037 0.0891 0.1009 0.1152 0.1038 0.1505 0.1608 0.0915 0.0981 0.1507 0.1622 0.1384 0.1435 0.1604 0.1479 0.1544 0.1383 0.1613 0.1545 0.1568
va: 1.1729 1.1252 1.1422 1.9431 2.1105 2.0647 3.5774 3.9582 3.5968 3.9149 3.9076 4.0138 4.0459 3.8797 4.0066 3.8778 3.8663 3.7177 3.9401 3.9479 3.7021 3.8866 4.0152 4.5564 3.6311 3.8450 3.9607 3.8544 3.8300 3.8442 0.9963 0.9942 1.0000 1.0045 1.0154 1.0030 1.0004 1.0043 0.9949 0.9869 0.9944 0.9897 1.0035 1.0067 1.0102 1.0040 0.9882 1.0055 0.9997 1.0142 0.9902 0.9933 0.9913
dispcorr: -0.032462473 hartree
energy: -3928.132415118288
dipole: -64.04754 61.54806 -2.49948 24.84091 -24.97970 -0.13879 -39.35009 38.91168 -0.43841
magnitude: 2.54143 au
magnitude: 6.45981 debye
