program: Orca
programVersion: 5.0.2
elementType: Br F F O O O C C C C C C C C C C C C C C C C C C C C C C C C H H H H H H H H H H H H H H H H H H H H H H H
charge: 0
multiplicity: 1
keywords: wb97x-d3
keywords: def2-TZVPP
keywords: def2/J RIJCOSX
keywords: DEFGRID2
keywords: scfconv7
keywords: smallprint printgap noloewdin
keywords: NOSOSCF
formula: C24H23BrF2O3
InChI: InChI=1/C24H23BrF2O3/c1-23(2,19-11-13-21(14-12-19)30-24(25,26)27)17-28-16-18-7-6-10-22(15-18)29-20-8-4-3-5-9-20/h3-15H,16-17H2,1-2H3
53 atoms
Br 2.394715 -1.398535 1.251067
F  3.781354 -1.90615 -0.993042
F  2.629772 -3.575356 -0.295621
O  -3.326196 0.129857 1.361425
O  1.678862 -1.891575 -1.392586
O  0.300198 2.60124 -1.29801
C  -3.910705 -1.469186 -0.341454
C  -4.13005 -0.060452 0.216792
C  -2.427181 -1.656146 -0.63637
C  -4.718522 -1.582333 -1.638657
C  -4.44717 -2.500782 0.650384
C  -1.668498 -2.660235 -0.046591
C  -1.769636 -0.788016 -1.511629
C  -3.312598 1.460104 1.828225
C  -0.304556 -2.789937 -0.281322
C  -0.408752 -0.881996 -1.742566
C  0.319947 -1.875127 -1.108356
C  -2.660777 2.411377 0.855959
C  -1.428711 2.090244 0.293242
C  -3.29902 3.587211 0.478115
C  -0.861427 2.937814 -0.645489
C  -2.712354 4.438212 -0.448405
C  -1.489125 4.118219 -1.017259
C  2.599233 -2.247835 -0.49144
C  1.452202 2.365449 -0.597272
C  1.66978 2.833231 0.692073
C  2.447678 1.668903 -1.273769
C  2.897026 2.596511 1.298614
C  3.67012 1.453913 -0.658506
C  3.901953 1.91389 0.63097
H  -3.892119 0.681486 -0.555041
H  -5.192337 0.071224 0.466876
H  -4.403801 -0.853298 -2.386346
H  -4.610046 -2.575941 -2.075177
H  -5.780491 -1.419156 -1.444624
H  -4.361273 -3.515647 0.259076
H  -5.506233 -2.312936 0.833679
H  -3.937515 -2.471998 1.61381
H  -2.126362 -3.37474 0.622779
H  -2.315871 0.001812 -2.011786
H  -4.327499 1.810048 2.055932
H  -2.758707 1.445009 2.769668
H  0.226731 -3.602983 0.191968
H  0.084581 -0.18196 -2.404373
H  -0.922067 1.173619 0.571135
H  -4.266472 3.830779 0.899776
H  -3.21513 5.350789 -0.740201
H  -1.032106 4.767698 -1.752802
H  0.906212 3.385038 1.224745
H  2.265799 1.311225 -2.279669
H  3.063856 2.961594 2.303791
H  4.444091 0.918212 -1.191561
H  4.853506 1.733687 1.112375
elementType: Br F O C H
totalener: -3928.09891373 hartree
nucrepener: 3695.25696001 hartree
electener: -7623.35587374 hartree
twoeener: 5165.06477036 hartree
cpcmener: -0.02566042 hartree
kineticenergy: 3918.77488001 hartree
xcener: -198.385064140788 hartree
chargesum: -0.0000000
charge: -0.073418 -0.153376 -0.161777 -0.388799 -0.266394 -0.342658 0.412373 -0.083205 -0.087106 -0.339505 -0.373087 -0.187338 -0.221852 0.074856 -0.139241 -0.210520 0.210183 -0.002512 -0.230276 -0.178057 0.285760 -0.133818 -0.233302 0.440716 0.334983 -0.208964 -0.277890 -0.150210 -0.126400 -0.190356 0.108537 0.110294 0.102562 0.108037 0.105419 0.106848 0.104083 0.099575 0.147860 0.140901 0.097505 0.111770 0.150361 0.157255 0.127432 0.144057 0.160883 0.148274 0.154260 0.153111 0.160520 0.151004 0.150641
qa: -0.0734 -0.1534 -0.1618 -0.3888 -0.2664 -0.3427 0.4124 -0.0832 -0.0871 -0.3395 -0.3731 -0.1873 -0.2219 0.0749 -0.1392 -0.2105 0.2102 -0.0025 -0.2303 -0.1781 0.2858 -0.1338 -0.2333 0.4407 0.3350 -0.2090 -0.2779 -0.1502 -0.1264 -0.1904 0.1085 0.1103 0.1026 0.1080 0.1054 0.1068 0.1041 0.0996 0.1479 0.1409 0.0975 0.1118 0.1504 0.1573 0.1274 0.1441 0.1609 0.1483 0.1543 0.1531 0.1605 0.1510 0.1506
va: 1.1744 1.1377 1.1262 1.9120 2.1080 2.0404 3.5113 3.9415 3.6621 3.9274 3.9317 4.0018 4.0091 3.8855 3.9592 3.9665 3.7705 3.6143 3.9441 3.9112 3.6305 3.8918 4.0375 4.5422 3.6552 3.9008 3.9179 3.8941 3.8336 3.8755 0.9846 1.0047 1.0017 1.0028 1.0024 0.9993 1.0061 1.0097 0.9989 1.0049 0.9989 0.9906 1.0153 1.0042 1.0176 1.0017 0.9883 1.0044 0.9990 1.0057 0.9883 0.9994 0.9934
dispcorr: -0.034639574 hartree
energy: -3928.133553306629
dipole: -68.37653 66.34265 -2.03388 26.83697 -26.08187 0.75510 -11.93810 12.26979 0.33169
magnitude: 2.19473 au
magnitude: 5.57857 debye
