program: Orca
programVersion: 5.0.2
elementType: Br F F O O O C C C C C C C C C C C C C C C C C C C C C C C C H H H H H H H H H H H H H H H H H H H H H H H
charge: 0
multiplicity: 1
keywords: wb97x-d3
keywords: def2-TZVPP
keywords: def2/J RIJCOSX
keywords: DEFGRID2
keywords: scfconv7
keywords: smallprint printgap noloewdin
keywords: NOSOSCF
formula: C24H23BrF2O3
InChI: InChI=1/C24H23BrF2O3/c1-23(2,19-11-13-21(14-12-19)30-24(25,26)27)17-28-16-18-7-6-10-22(15-18)29-20-8-4-3-5-9-20/h3-15H,16-17H2,1-2H3
53 atoms
Br 2.186858 -3.743012 0.219019
F  2.378476 -2.999482 2.79314
F  2.607588 -1.374432 1.411592
O  -3.891391 1.357103 -0.273975
O  0.602294 -2.211152 1.904288
O  1.477998 3.367787 0.516987
C  -3.295261 -0.392873 -1.838313
C  -3.405465 1.114865 -1.578255
C  -2.249296 -0.957378 -0.885912
C  -2.854961 -0.578745 -3.29502
C  -4.662095 -1.055506 -1.6720
C  -0.913499 -0.583465 -1.031191
C  -2.563485 -1.786474 0.186615
C  -3.384781 2.528224 0.337015
C  0.071955 -0.984629 -0.145948
C  -1.589542 -2.219492 1.07725
C  -0.280902 -1.807868 0.911637
C  -2.016583 2.302569 0.927361
C  -0.903498 2.956873 0.415925
C  -1.85921 1.403016 1.98131
C  0.35587 2.705637 0.952298
C  -0.603061 1.168357 2.513655
C  0.515393 1.810062 1.996605
C  1.890288 -2.475594 1.675949
C  1.663571 3.595558 -0.82299
C  1.327917 2.655807 -1.790037
C  2.260752 4.795918 -1.182113
C  1.577258 2.936734 -3.125746
C  2.518244 5.057185 -2.520742
C  2.169411 4.136008 -3.499134
H  -2.422627 1.578286 -1.728082
H  -4.083626 1.562548 -2.317897
H  -1.921693 -0.063174 -3.523236
H  -2.719329 -1.635978 -3.526529
H  -3.615358 -0.186518 -3.972858
H  -5.085279 -0.930729 -0.675666
H  -4.606091 -2.126245 -1.877231
H  -5.368848 -0.62409 -2.383283
H  -0.618666 0.065176 -1.845734
H  -3.580291 -2.113792 0.354226
H  -3.361832 3.367823 -0.36745
H  -4.090904 2.791406 1.127303
H  1.07797 -0.620046 -0.293915
H  -1.857976 -2.859744 1.907862
H  -1.027992 3.664389 -0.395631
H  -2.720809 0.889013 2.389333
H  -0.483067 0.471094 3.332384
H  1.499383 1.621463 2.406652
H  0.880494 1.710082 -1.513714
H  2.52517 5.518059 -0.419872
H  1.308548 2.205244 -3.876864
H  2.986132 5.993249 -2.796364
H  2.361723 4.348115 -4.542375
elementType: Br F O C H
totalener: -3928.09877282 hartree
nucrepener: 3596.88634014 hartree
electener: -7524.98511296 hartree
twoeener: 5065.69554363 hartree
cpcmener: -0.02903267 hartree
kineticenergy: 3918.76729761 hartree
xcener: -198.380705684986 hartree
chargesum: -0.0000000
charge: -0.075249 -0.148563 -0.158389 -0.398034 -0.266728 -0.344385 0.393885 -0.077947 -0.040469 -0.339992 -0.364211 -0.274719 -0.183969 0.066468 -0.125391 -0.181052 0.184271 0.075708 -0.220864 -0.306101 0.309690 -0.062255 -0.282926 0.424435 0.259855 -0.143425 -0.222253 -0.200489 -0.145574 -0.162926 0.099153 0.110745 0.102178 0.108291 0.105134 0.094186 0.113523 0.105806 0.154665 0.142133 0.102815 0.109344 0.154917 0.148404 0.143639 0.142521 0.155593 0.142557 0.148278 0.147229 0.158765 0.161037 0.160683
qa: -0.0752 -0.1486 -0.1584 -0.3980 -0.2667 -0.3444 0.3939 -0.0779 -0.0405 -0.3400 -0.3642 -0.2747 -0.1840 0.0665 -0.1254 -0.1811 0.1843 0.0757 -0.2209 -0.3061 0.3097 -0.0623 -0.2829 0.4244 0.2599 -0.1434 -0.2223 -0.2005 -0.1456 -0.1629 0.0992 0.1107 0.1022 0.1083 0.1051 0.0942 0.1135 0.1058 0.1547 0.1421 0.1028 0.1093 0.1549 0.1484 0.1436 0.1425 0.1556 0.1426 0.1483 0.1472 0.1588 0.1610 0.1607
va: 1.1807 1.1460 1.1277 1.9085 2.0857 2.0651 3.5534 3.9734 3.5831 3.9211 3.9163 4.0848 3.9575 3.8898 3.8651 4.0228 3.6861 3.5168 3.8919 3.9446 3.6380 3.7840 3.9828 4.5748 3.7008 3.8291 3.9743 3.9420 3.8969 3.8736 0.9849 1.0043 1.0010 1.0020 1.0038 1.0130 0.9988 1.0046 0.9909 0.9977 0.9962 0.9912 1.0093 1.0041 1.0074 1.0083 0.9913 1.0124 0.9885 1.0076 0.9925 0.9881 0.9892
dispcorr: -0.034225824 hartree
energy: -3928.132998641029
dipole: -57.94408 56.83130 -1.11278 61.96736 -61.24560 0.72177 -28.52295 26.97247 -1.55049
magnitude: 2.04040 au
magnitude: 5.18629 debye
