program: Orca
programVersion: 5.0.2
elementType: Br F F O O O C C C C C C C C C C C C C C C C C C C C C C C C H H H H H H H H H H H H H H H H H H H H H H H
charge: 0
multiplicity: 1
keywords: wb97x-d3
keywords: def2-TZVPP
keywords: def2/J RIJCOSX
keywords: DEFGRID2
keywords: scfconv7
keywords: smallprint printgap noloewdin
keywords: NOSOSCF
formula: C24H23BrF2O3
InChI: InChI=1/C24H23BrF2O3/c1-23(2,19-11-13-21(14-12-19)30-24(25,26)27)17-28-16-18-7-6-10-22(15-18)29-20-8-4-3-5-9-20/h3-15H,16-17H2,1-2H3
53 atoms
Br 1.669578 -3.945633 1.53625
F  2.653188 -2.407143 -0.430434
F  2.209395 -4.411106 -1.05116
O  -3.66353 1.41744 -0.828815
O  0.566969 -3.057293 -0.854343
O  1.765437 3.118979 -1.411818
C  -3.318972 0.477152 1.370039
C  -3.293485 1.735793 0.496288
C  -2.280567 -0.497493 0.827948
C  -4.727215 -0.117404 1.387701
C  -2.966899 0.904052 2.799099
C  -2.625021 -1.659788 0.143612
C  -0.920736 -0.212606 0.955343
C  -3.065761 2.231939 -1.818075
C  -1.658156 -2.507297 -0.378559
C  0.063366 -1.034389 0.429271
C  -0.321978 -2.187457 -0.235153
C  -1.625516 1.854383 -2.045598
C  -0.60343 2.695189 -1.626223
C  -1.310743 0.628046 -2.629085
C  0.722856 2.305517 -1.778795
C  0.013729 0.25771 -2.792909
C  1.03965 1.088478 -2.359898
C  1.749805 -3.39155 -0.335112
C  1.671565 3.867705 -0.264591
C  2.165788 5.162974 -0.308315
C  1.1577 3.343797 0.915358
C  2.143432 5.940055 0.842043
C  1.129289 4.135819 2.053711
C  1.619391 5.43514 2.023862
H  -3.985693 2.482063 0.909692
H  -2.29002 2.177396 0.537253
H  -4.770837 -1.010667 2.013099
H  -5.425505 0.609634 1.80537
H  -5.095452 -0.388136 0.398682
H  -3.73158 1.576743 3.191072
H  -2.013147 1.429443 2.858266
H  -2.914032 0.039595 3.461956
H  -3.661491 -1.934831 0.008123
H  -0.601102 0.684243 1.469099
H  -3.643159 2.077092 -2.731485
H  -3.144431 3.294332 -1.559627
H  -1.948298 -3.407777 -0.904383
H  1.098448 -0.741521 0.532878
H  -0.849296 3.653191 -1.183075
H  -2.101554 -0.034085 -2.95963
H  0.25828 -0.693415 -3.247535
H  2.075019 0.793958 -2.474955
H  2.567745 5.557628 -1.232724
H  0.787061 2.327785 0.953979
H  2.530861 6.949763 0.806974
H  0.725139 3.727125 2.970649
H  1.596085 6.047118 2.915485
elementType: Br F O C H
totalener: -3928.09914264 hartree
nucrepener: 3564.69576453 hartree
electener: -7492.79490717 hartree
twoeener: 5033.45802624 hartree
cpcmener: -0.02914544 hartree
kineticenergy: 3918.78215649 hartree
xcener: -198.382415455654 hartree
chargesum: -0.0000000
charge: -0.074989 -0.158219 -0.149993 -0.394902 -0.267072 -0.344361 0.394196 -0.084277 -0.035333 -0.358609 -0.342607 -0.188131 -0.263612 0.062587 -0.172964 -0.149153 0.181950 0.070466 -0.218666 -0.295074 0.303220 -0.087061 -0.272708 0.421458 0.255338 -0.217763 -0.162877 -0.146367 -0.194800 -0.161165 0.111659 0.097414 0.114075 0.104804 0.093808 0.105499 0.101914 0.109241 0.142989 0.163978 0.110632 0.101919 0.149785 0.155944 0.147249 0.141599 0.156499 0.145149 0.146948 0.168836 0.160938 0.159203 0.161404
qa: -0.0750 -0.1582 -0.1500 -0.3949 -0.2671 -0.3444 0.3942 -0.0843 -0.0353 -0.3586 -0.3426 -0.1881 -0.2636 0.0626 -0.1730 -0.1492 0.1820 0.0705 -0.2187 -0.2951 0.3032 -0.0871 -0.2727 0.4215 0.2553 -0.2178 -0.1629 -0.1464 -0.1948 -0.1612 0.1117 0.0974 0.1141 0.1048 0.0938 0.1055 0.1019 0.1092 0.1430 0.1640 0.1106 0.1019 0.1498 0.1559 0.1472 0.1416 0.1565 0.1451 0.1469 0.1688 0.1609 0.1592 0.1614
va: 1.1806 1.1288 1.1433 1.9125 2.0891 2.0652 3.5442 3.9913 3.5726 3.9135 3.9243 3.9772 4.0428 3.9003 4.0272 3.8916 3.6894 3.5080 3.8741 3.9410 3.6607 3.8074 3.9906 4.5805 3.7171 3.9798 3.8368 3.8943 3.9358 3.8756 1.0052 0.9802 0.9991 1.0047 1.0131 1.0038 0.9999 1.0018 0.9971 0.9870 0.9904 0.9961 1.0034 1.0104 1.0057 1.0084 0.9904 1.0084 1.0072 0.9845 0.9883 0.9927 0.9889
dispcorr: -0.033660825 hartree
energy: -3928.132803465865
dipole: -52.13447 50.95926 -1.17521 76.44927 -75.00941 1.43986 -5.49097 6.45114 0.96017
magnitude: 2.09195 au
magnitude: 5.31731 debye
