program: Orca
programVersion: 5.0.2
elementType: Br F F O O O C C C C C C C C C C C C C C C C C C C C C C C C H H H H H H H H H H H H H H H H H H H H H H H
charge: 0
multiplicity: 1
keywords: wb97x-d3
keywords: def2-TZVPP
keywords: def2/J RIJCOSX
keywords: DEFGRID2
keywords: scfconv7
keywords: smallprint printgap noloewdin
keywords: NOSOSCF
formula: C24H23BrF2O3
InChI: InChI=1/C24H23BrF2O3/c1-23(2,19-11-13-21(14-12-19)30-24(25,26)27)17-28-16-18-7-6-10-22(15-18)29-20-8-4-3-5-9-20/h3-15H,16-17H2,1-2H3
53 atoms
Br 2.235643 -4.167267 0.136081
F  3.993629 -2.292158 0.911404
F  3.361971 -2.086543 -1.127918
O  -3.620318 1.193736 -0.137023
O  2.069308 -1.428918 0.56448
O  0.554524 3.66279 1.196609
C  -3.400998 -1.021705 -1.017249
C  -4.189518 -0.093219 -0.095859
C  -1.928944 -1.079835 -0.619552
C  -3.583916 -0.55568 -2.465291
C  -3.997555 -2.426799 -0.86775
C  -1.5206 -0.94776 0.70873
C  -0.938334 -1.336277 -1.564496
C  -4.072201 2.069469 0.868106
C  -0.190767 -1.0745 1.075441
C  0.40105 -1.463589 -1.221335
C  0.761506 -1.342601 0.108559
C  -3.077332 3.185179 1.018273
C  -1.716457 2.895981 1.017707
C  -3.496563 4.500687 1.183443
C  -0.795105 3.921277 1.161638
C  -2.564092 5.514827 1.352192
C  -1.205607 5.235404 1.330918
C  2.932573 -2.341523 0.115563
C  1.131711 2.896234 0.217321
C  2.307894 2.240675 0.559869
C  0.62476 2.806175 -1.074285
C  2.984908 1.50116 -0.398375
C  1.306683 2.049515 -2.01735
C  2.486476 1.395889 -1.689924
H  -5.236512 -0.072595 -0.427703
H  -4.199067 -0.477686 0.932552
H  -3.204397 -1.286099 -3.179892
H  -4.646489 -0.428932 -2.679706
H  -3.085988 0.39366 -2.665109
H  -5.056197 -2.429022 -1.136323
H  -3.908837 -2.792873 0.156512
H  -3.487695 -3.135262 -1.521852
H  -2.237513 -0.749415 1.494177
H  -1.193281 -1.444934 -2.609367
H  -5.064344 2.474341 0.632179
H  -4.169331 1.536282 1.823785
H  0.101369 -0.970222 2.112419
H  1.122895 -1.645481 -2.00423
H  -1.371984 1.874739 0.906025
H  -4.553991 4.734399 1.176876
H  -2.895992 6.53651 1.481443
H  -0.475048 6.025979 1.444412
H  2.694466 2.318731 1.568164
H  -0.284792 3.319368 -1.357883
H  3.902377 0.995916 -0.125799
H  0.907712 1.978714 -3.02082
H  3.010172 0.809933 -2.433123
elementType: Br F O C H
totalener: -3928.09930655 hartree
nucrepener: 3577.84363036 hartree
electener: -7505.94293691 hartree
twoeener: 5047.69887717 hartree
cpcmener: -0.02929931 hartree
kineticenergy: 3918.77993020 hartree
xcener: -198.380809765718 hartree
chargesum: -0.0000000
charge: -0.072787 -0.151951 -0.161551 -0.384201 -0.271206 -0.340153 0.358853 -0.051207 -0.050119 -0.375340 -0.329256 -0.227334 -0.177213 0.078446 -0.139668 -0.142141 0.136396 -0.012117 -0.159473 -0.209405 0.230653 -0.127187 -0.232654 0.433803 0.296975 -0.240517 -0.179441 -0.131442 -0.179385 -0.180786 0.107191 0.106885 0.100357 0.102267 0.108392 0.104604 0.103269 0.104899 0.147732 0.147817 0.097043 0.096805 0.148738 0.154123 0.137005 0.143234 0.160669 0.147795 0.145280 0.153870 0.154351 0.161667 0.157416
qa: -0.0728 -0.1520 -0.1616 -0.3842 -0.2712 -0.3402 0.3589 -0.0512 -0.0501 -0.3753 -0.3293 -0.2273 -0.1772 0.0784 -0.1397 -0.1421 0.1364 -0.0121 -0.1595 -0.2094 0.2307 -0.1272 -0.2327 0.4338 0.2970 -0.2405 -0.1794 -0.1314 -0.1794 -0.1808 0.1072 0.1069 0.1004 0.1023 0.1084 0.1046 0.1033 0.1049 0.1477 0.1478 0.0970 0.0968 0.1487 0.1541 0.1370 0.1432 0.1607 0.1478 0.1453 0.1539 0.1544 0.1617 0.1574
va: 1.1841 1.1432 1.1279 1.9304 2.0662 2.0652 3.5343 3.9135 3.6233 3.9325 3.9175 3.9507 3.9461 3.8816 3.9653 3.9168 3.6858 3.7236 3.8710 3.9437 3.7594 3.8925 3.9932 4.5623 3.6696 3.9574 3.8349 3.8292 3.8616 3.8114 1.0002 0.9927 1.0018 1.0046 1.0099 1.0035 1.0034 1.0033 0.9970 0.9987 0.9962 0.9904 1.0043 1.0125 1.0217 1.0048 0.9882 1.0053 1.0087 0.9989 0.9962 0.9907 0.9933
dispcorr: -0.033327498 hartree
energy: -3928.132634047062
dipole: -68.18920 65.75682 -2.43238 59.82923 -60.08641 -0.25718 -9.78889 9.59478 -0.19410
magnitude: 2.45363 au
magnitude: 6.23663 debye
