program: Orca
programVersion: 5.0.2
elementType: Br F F O O O C C C C C C C C C C C C C C C C C C C C C C C C H H H H H H H H H H H H H H H H H H H H H H H
charge: 0
multiplicity: 1
keywords: wb97x-d3
keywords: def2-TZVPP
keywords: def2/J RIJCOSX
keywords: DEFGRID2
keywords: scfconv7
keywords: smallprint printgap noloewdin
keywords: NOSOSCF
formula: C24H23BrF2O3
InChI: InChI=1/C24H23BrF2O3/c1-23(2,19-11-13-21(14-12-19)30-24(25,26)27)17-28-16-18-7-6-10-22(15-18)29-20-8-4-3-5-9-20/h3-15H,16-17H2,1-2H3
53 atoms
Br 2.438973 -3.654015 -0.263405
F  2.840518 -1.480256 1.26348
F  3.958533 -1.461425 -0.566995
O  -3.845994 0.83203 0.067311
O  1.880708 -0.965568 -0.677026
O  0.505119 2.873739 1.526174
C  -3.795159 -1.482879 -0.52937
C  -4.359443 -0.098301 -0.856612
C  -2.274654 -1.383637 -0.523731
C  -4.263033 -2.453376 -1.618603
C  -4.356842 -1.9622 0.809053
C  -1.513189 -1.591671 0.620489
C  -1.59304 -1.025872 -1.689465
C  -4.002629 2.178026 -0.304162
C  -0.128555 -1.463903 0.620996
C  -0.215509 -0.903994 -1.716917
C  0.510135 -1.133647 -0.559353
C  -2.984197 3.018595 0.413467
C  -1.69833 2.533488 0.635411
C  -3.307267 4.308632 0.822268
C  -0.755664 3.34854 1.242691
C  -2.354903 5.111374 1.432662
C  -1.067585 4.638713 1.641775
C  2.767217 -1.736934 -0.049435
C  1.382493 2.578329 0.519342
C  1.125318 2.796203 -0.828549
C  2.608525 2.059555 0.926304
C  2.105943 2.484359 -1.7636
C  3.579553 1.770268 -0.01768
C  3.334718 1.977833 -1.369795
H  -4.081782 0.188236 -1.880014
H  -5.457202 -0.129227 -0.820174
H  -5.353429 -2.501132 -1.642614
H  -3.925986 -2.158987 -2.612939
H  -3.891776 -3.46034 -1.42446
H  -3.991887 -2.959558 1.059295
H  -5.444814 -2.019021 0.747893
H  -4.111119 -1.3000 1.639302
H  -1.986889 -1.855012 1.555608
H  -2.138234 -0.837699 -2.605828
H  -3.858304 2.295344 -1.386994
H  -5.014459 2.540557 -0.082866
H  0.407085 -1.617925 1.546736
H  0.294054 -0.635759 -2.633466
H  -1.423852 1.528797 0.334585
H  -4.310925 4.684903 0.666776
H  -2.615507 6.112012 1.75116
H  -0.318964 5.257311 2.119708
H  0.18356 3.208099 -1.165132
H  2.799659 1.898521 1.979915
H  1.899611 2.654552 -2.812352
H  4.53347 1.377739 0.309182
H  4.092156 1.745537 -2.106115
elementType: Br F O C H
totalener: -3928.09921466 hartree
nucrepener: 3604.29971393 hartree
electener: -7532.39892859 hartree
twoeener: 5074.53617374 hartree
cpcmener: -0.02932959 hartree
kineticenergy: 3918.78471141 hartree
xcener: -198.382034689489 hartree
chargesum: -0.0000000
charge: -0.073012 -0.164406 -0.151715 -0.383047 -0.263337 -0.336808 0.407237 -0.079316 -0.114210 -0.332403 -0.372425 -0.180137 -0.160126 0.086559 -0.113475 -0.221280 0.171537 -0.002739 -0.156762 -0.197780 0.228103 -0.140362 -0.206309 0.440890 0.330838 -0.214533 -0.243267 -0.180654 -0.150757 -0.172862 0.108880 0.106007 0.104617 0.102461 0.108092 0.110228 0.104651 0.096618 0.146709 0.142234 0.093254 0.094967 0.151735 0.149523 0.104326 0.143045 0.160126 0.148408 0.155643 0.143430 0.160017 0.154658 0.156927
qa: -0.0730 -0.1644 -0.1517 -0.3830 -0.2633 -0.3368 0.4072 -0.0793 -0.1142 -0.3324 -0.3724 -0.1801 -0.1601 0.0866 -0.1135 -0.2213 0.1715 -0.0027 -0.1568 -0.1978 0.2281 -0.1404 -0.2063 0.4409 0.3308 -0.2145 -0.2433 -0.1807 -0.1508 -0.1729 0.1089 0.1060 0.1046 0.1025 0.1081 0.1102 0.1047 0.0966 0.1467 0.1422 0.0933 0.0950 0.1517 0.1495 0.1043 0.1430 0.1601 0.1484 0.1556 0.1434 0.1600 0.1547 0.1569
va: 1.1842 1.1266 1.1443 1.9238 2.0965 2.0635 3.5411 3.9426 3.7019 3.9225 3.9259 3.9463 3.9587 3.8912 3.9452 4.0162 3.7015 3.7059 3.9043 3.9324 3.7478 3.8993 3.9934 4.5478 3.6283 3.8319 3.9432 3.8889 3.8270 3.8554 0.9933 0.9997 1.0030 1.0026 1.0025 0.9992 1.0057 1.0105 0.9973 1.0034 0.9910 0.9945 1.0140 1.0057 1.0270 1.0048 0.9886 1.0034 0.9999 1.0106 0.9902 0.9949 0.9908
dispcorr: -0.032942279 hartree
energy: -3928.132156935204
dipole: -70.00865 67.72463 -2.28402 49.99343 -49.70217 0.29126 -4.60736 3.29650 -1.31086
magnitude: 2.64951 au
magnitude: 6.73453 debye
