program: Orca
programVersion: 5.0.2
elementType: Br F F O O O C C C C C C C C C C C C C C C C C C C C C C C C H H H H H H H H H H H H H H H H H H H H H H H
charge: 0
multiplicity: 1
keywords: wb97x-d3
keywords: def2-TZVPP
keywords: def2/J RIJCOSX
keywords: DEFGRID2
keywords: scfconv7
keywords: smallprint printgap noloewdin
keywords: NOSOSCF
formula: C24H23BrF2O3
InChI: InChI=1/C24H23BrF2O3/c1-23(2,19-11-13-21(14-12-19)30-24(25,26)27)17-28-16-18-7-6-10-22(15-18)29-20-8-4-3-5-9-20/h3-15H,16-17H2,1-2H3
53 atoms
Br 1.936274 -3.637935 1.317628
F  1.993007 -1.069527 2.119925
F  3.631084 -1.611855 0.842861
O  -3.620125 1.592454 -1.15352
O  1.748294 -1.251926 -0.084937
O  1.404962 1.911228 0.429764
C  -3.794875 -0.81001 -1.334679
C  -4.287935 0.460337 -0.635441
C  -2.318249 -0.987278 -1.007598
C  -4.057542 -0.709502 -2.837106
C  -4.609414 -1.987647 -0.789348
C  -1.921222 -1.238711 0.304982
C  -1.31259 -0.85313 -1.960643
C  -3.423555 2.632909 -0.217677
C  -0.588672 -1.344277 0.672813
C  0.027284 -0.966268 -1.621797
C  0.381354 -1.207491 -0.307093
C  -2.239572 2.366372 0.675354
C  -0.968078 2.288892 0.108711
C  -2.398608 2.156406 2.039038
C  0.131075 2.034244 0.914084
C  -1.291873 1.88318 2.834478
C  -0.024774 1.82687 2.28073
C  2.320954 -1.740646 1.009031
C  1.810389 2.584648 -0.692958
C  2.641676 1.900345 -1.569495
C  1.479459 3.914727 -0.924173
C  3.139049 2.551374 -2.689379
C  1.974474 4.548565 -2.054931
C  2.802424 3.873776 -2.942427
H  -5.3710 0.56367 -0.786426
H  -4.125892 0.36423 0.444673
H  -3.74288 -1.617552 -3.354251
H  -5.12708 -0.585863 -3.014299
H  -3.550563 0.131436 -3.309717
H  -4.273039 -2.927615 -1.228679
H  -5.665436 -1.865735 -1.036948
H  -4.538339 -2.081628 0.294755
H  -2.660214 -1.338462 1.089523
H  -1.555261 -0.656375 -2.995379
H  -3.254679 3.542649 -0.797778
H  -4.321692 2.799513 0.387673
H  -0.357422 -1.509566 1.71434
H  0.792973 -0.858876 -2.379547
H  -0.850259 2.433799 -0.95866
H  -3.385939 2.207556 2.480948
H  -1.416644 1.715972 3.896309
H  0.84045 1.622319 2.898311
H  2.908259 0.870711 -1.369935
H  0.845428 4.457617 -0.234998
H  3.78961 2.015577 -3.368055
H  1.713075 5.582726 -2.23695
H  3.186074 4.376372 -3.820048
elementType: Br F O C H
totalener: -3928.09927304 hartree
nucrepener: 3662.79571325 hartree
electener: -7590.89498629 hartree
twoeener: 5132.95929483 hartree
cpcmener: -0.02758960 hartree
kineticenergy: 3918.79449403 hartree
xcener: -198.386809205692 hartree
chargesum: -0.0000000
charge: -0.081729 -0.157344 -0.150965 -0.399356 -0.255801 -0.337627 0.407768 -0.085636 -0.064133 -0.368367 -0.340233 -0.291170 -0.159820 0.071752 -0.132311 -0.236201 0.268160 0.052930 -0.279885 -0.225899 0.357758 -0.098883 -0.300176 0.430320 0.336865 -0.291513 -0.217907 -0.115296 -0.143770 -0.195619 0.110195 0.106852 0.112524 0.105169 0.094136 0.108131 0.104513 0.103242 0.142735 0.144095 0.109776 0.102518 0.142790 0.147361 0.137738 0.142973 0.158848 0.140858 0.148176 0.156946 0.161867 0.161835 0.160806
qa: -0.0817 -0.1573 -0.1510 -0.3994 -0.2558 -0.3376 0.4078 -0.0856 -0.0641 -0.3684 -0.3402 -0.2912 -0.1598 0.0718 -0.1323 -0.2362 0.2682 0.0529 -0.2799 -0.2259 0.3578 -0.0989 -0.3002 0.4303 0.3369 -0.2915 -0.2179 -0.1153 -0.1438 -0.1956 0.1102 0.1069 0.1125 0.1052 0.0941 0.1081 0.1045 0.1032 0.1427 0.1441 0.1098 0.1025 0.1428 0.1474 0.1377 0.1430 0.1588 0.1409 0.1482 0.1569 0.1619 0.1618 0.1608
va: 1.1757 1.1315 1.1437 1.9066 2.1267 2.0355 3.5275 3.9733 3.6264 3.9208 3.9193 4.1241 3.9382 3.8895 3.9128 4.0152 3.5905 3.5799 3.9286 3.9012 3.5263 3.8621 3.9860 4.5612 3.6474 3.9667 3.9358 3.8893 3.8855 3.9140 1.0043 0.9854 0.9993 1.0050 1.0126 1.0020 1.0039 1.0015 1.0059 0.9975 0.9916 0.9945 1.0184 1.0044 1.0173 1.0041 0.9875 1.0164 1.0224 0.9980 0.9893 0.9891 0.9895
dispcorr: -0.034986849 hartree
energy: -3928.134259889170
dipole: -61.16822 59.22676 -1.94146 54.52015 -53.98661 0.53354 -31.62117 31.53168 -0.08950
magnitude: 2.01543 au
magnitude: 5.12281 debye
