program: Orca
programVersion: 5.0.2
elementType: Br F F O O O C C C C C C C C C C C C C C C C C C C C C C C C H H H H H H H H H H H H H H H H H H H H H H H
charge: 0
multiplicity: 1
keywords: wb97x-d3
keywords: def2-TZVPP
keywords: def2/J RIJCOSX
keywords: DEFGRID2
keywords: scfconv7
keywords: smallprint printgap noloewdin
keywords: NOSOSCF
formula: C24H23BrF2O3
InChI: InChI=1/C24H23BrF2O3/c1-23(2,19-11-13-21(14-12-19)30-24(25,26)27)17-28-16-18-7-6-10-22(15-18)29-20-8-4-3-5-9-20/h3-15H,16-17H2,1-2H3
53 atoms
Br 2.388461 -1.854515 -1.833628
F  3.559772 -3.647454 -0.213856
F  3.008035 -1.827612 0.777896
O  -3.241307 0.840176 -0.87561
O  1.49689 -3.389197 0.303432
O  0.654356 2.885673 1.960013
C  -3.822333 -1.356945 -0.081269
C  -3.943677 0.148632 0.133455
C  -2.377621 -1.838034 -0.000095
C  -4.460579 -1.717739 -1.427825
C  -4.613981 -2.033702 1.044711
C  -2.019319 -3.071675 -0.544914
C  -1.385771 -1.125397 0.672744
C  -3.378642 2.241055 -0.789734
C  -0.727873 -3.562412 -0.449098
C  -0.086367 -1.601769 0.788503
C  0.230875 -2.817725 0.211485
C  -2.681941 2.824063 0.412962
C  -1.321256 2.586394 0.594491
C  -3.381374 3.570161 1.352643
C  -0.672066 3.112435 1.701203
C  -2.72252 4.085934 2.461868
C  -1.367413 3.86543 2.640761
C  2.592048 -2.743214 -0.109337
C  1.53706 2.704258 0.922254
C  2.437342 1.654272 1.025508
C  1.577026 3.57406 -0.160861
C  3.394052 1.478088 0.034533
C  2.528753 3.376604 -1.150542
C  3.43976 2.331839 -1.057912
H  -5.00903 0.417433 0.104615
H  -3.582727 0.427613 1.131837
H  -3.876814 -1.356974 -2.274725
H  -4.583601 -2.79412 -1.546064
H  -5.457193 -1.277458 -1.49483
H  -4.588021 -3.118955 0.938846
H  -5.660729 -1.722541 1.023966
H  -4.207262 -1.784187 2.026363
H  -2.752094 -3.676865 -1.061027
H  -1.603752 -0.175022 1.140181
H  -2.942947 2.646128 -1.70578
H  -4.437703 2.529147 -0.777429
H  -0.471059 -4.5188 -0.885793
H  0.643214 -1.016018 1.331436
H  -0.778412 1.99216 -0.131181
H  -4.442113 3.744618 1.221006
H  -3.268253 4.666131 3.194296
H  -0.850059 4.267849 3.502315
H  2.395783 0.988845 1.878696
H  0.878923 4.398463 -0.23532
H  4.100734 0.663721 0.115411
H  2.559936 4.050796 -1.996371
H  4.18146 2.186011 -1.831656
elementType: Br F O C H
totalener: -3928.09945909 hartree
nucrepener: 3577.73152530 hartree
electener: -7505.83098439 hartree
twoeener: 5047.07570716 hartree
cpcmener: -0.02700466 hartree
kineticenergy: 3918.76891159 hartree
xcener: -198.377167664571 hartree
chargesum: -0.0000000
charge: -0.070652 -0.152306 -0.157945 -0.389056 -0.271849 -0.345757 0.339549 -0.065659 -0.048163 -0.365108 -0.331944 -0.177397 -0.225095 0.073981 -0.161904 -0.122424 0.122623 0.005780 -0.272395 -0.193028 0.312081 -0.123332 -0.256861 0.425550 0.308072 -0.272533 -0.193506 -0.122135 -0.146826 -0.175000 0.108762 0.107609 0.104979 0.101443 0.101609 0.104621 0.104097 0.105370 0.148633 0.167676 0.114283 0.097675 0.151073 0.165874 0.136887 0.143608 0.160190 0.148585 0.151483 0.157362 0.151916 0.162042 0.157462
qa: -0.0707 -0.1523 -0.1579 -0.3891 -0.2718 -0.3458 0.3395 -0.0657 -0.0482 -0.3651 -0.3319 -0.1774 -0.2251 0.0740 -0.1619 -0.1224 0.1226 0.0058 -0.2724 -0.1930 0.3121 -0.1233 -0.2569 0.4255 0.3081 -0.2725 -0.1935 -0.1221 -0.1468 -0.1750 0.1088 0.1076 0.1050 0.1014 0.1016 0.1046 0.1041 0.1054 0.1486 0.1677 0.1143 0.0977 0.1511 0.1659 0.1369 0.1436 0.1602 0.1486 0.1515 0.1574 0.1519 0.1620 0.1575
va: 1.1777 1.1414 1.1240 1.9180 2.1022 2.0538 3.6004 3.9202 3.6760 3.9308 3.9254 3.9415 4.0054 3.8766 4.0204 3.9781 3.8038 3.5982 3.9022 3.9101 3.6778 3.8987 4.0070 4.5521 3.6574 3.9716 3.9153 3.8334 3.8920 3.8972 1.0020 0.9826 1.0100 1.0039 1.0032 1.0023 1.0038 1.0035 0.9969 0.9814 0.9909 1.0003 1.0038 0.9990 1.0148 1.0029 0.9880 1.0063 1.0078 0.9967 1.0012 0.9887 0.9914
dispcorr: -0.031571995 hartree
energy: -3928.131031085468
dipole: -69.30597 67.22088 -2.08509 34.14928 -33.52323 0.62605 20.20878 -20.29412 -0.08534
magnitude: 2.17872 au
magnitude: 5.53787 debye
