program: Orca
programVersion: 5.0.2
elementType: Br F F O O O C C C C C C C C C C C C C C C C C C C C C C C C H H H H H H H H H H H H H H H H H H H H H H H
charge: 0
multiplicity: 1
keywords: wb97x-d3
keywords: def2-TZVPP
keywords: def2/J RIJCOSX
keywords: DEFGRID2
keywords: scfconv7
keywords: smallprint printgap noloewdin
keywords: NOSOSCF
formula: C24H23BrF2O3
InChI: InChI=1/C24H23BrF2O3/c1-23(2,19-11-13-21(14-12-19)30-24(25,26)27)17-28-16-18-7-6-10-22(15-18)29-20-8-4-3-5-9-20/h3-15H,16-17H2,1-2H3
53 atoms
Br 2.578661 -3.71261 -0.144857
F  2.88354 -1.551918 1.428195
F  4.025218 -1.468771 -0.387154
O  -3.596809 0.668329 1.365192
O  1.937447 -1.034731 -0.517694
O  0.16755 3.079434 -1.139167
C  -3.74821 -1.219399 -0.111663
C  -4.186439 0.221246 0.163377
C  -2.226847 -1.238816 -0.200535
C  -4.381007 -1.650366 -1.438505
C  -4.282183 -2.142917 0.98438
C  -1.572694 -0.679137 -1.300294
C  -1.429612 -1.734242 0.82467
C  -3.793739 2.035607 1.622245
C  -0.192218 -0.637615 -1.382058
C  -0.041008 -1.688492 0.775307
C  0.568848 -1.147474 -0.341667
C  -3.002344 2.945292 0.715147
C  -1.747471 2.565262 0.247037
C  -3.51998 4.186454 0.361305
C  -1.026717 3.433476 -0.560823
C  -2.785118 5.049839 -0.437549
C  -1.532297 4.680333 -0.900925
C  2.836991 -1.787338 0.111181
C  1.243973 2.636317 -0.424273
C  2.337276 2.24422 -1.192102
C  1.312526 2.599563 0.96233
C  3.496328 1.812172 -0.570528
C  2.479195 2.147982 1.569441
C  3.573221 1.752301 0.815478
H  -3.893775 0.859268 -0.680701
H  -5.282403 0.266512 0.236304
H  -4.083354 -2.667097 -1.697932
H  -5.469475 -1.633892 -1.359235
H  -4.108106 -0.999406 -2.26912
H  -3.953692 -1.865105 1.985233
H  -3.979643 -3.176963 0.810593
H  -5.373094 -2.115486 0.983915
H  -2.14006 -0.258552 -2.120213
H  -1.876372 -2.16959 1.707098
H  -4.857239 2.301526 1.566857
H  -3.480921 2.199724 2.656882
H  0.291271 -0.20909 -2.250604
H  0.512698 -2.07026 1.620451
H  -1.341539 1.592717 0.498132
H  -4.505896 4.474537 0.705405
H  -3.19333 6.0138 -0.711103
H  -0.958104 5.343372 -1.535211
H  2.275693 2.28442 -2.272493
H  0.48301 2.917304 1.578967
H  4.340547 1.512033 -1.177266
H  2.524799 2.115225 2.650152
H  4.476075 1.406877 1.300671
elementType: Br F O C H
totalener: -3928.09877268 hartree
nucrepener: 3620.41895192 hartree
electener: -7548.51772460 hartree
twoeener: 5090.35702052 hartree
cpcmener: -0.02630786 hartree
kineticenergy: 3918.78271455 hartree
xcener: -198.385509912825 hartree
chargesum: -0.0000000
charge: -0.078342 -0.162790 -0.151002 -0.385705 -0.258226 -0.332727 0.400303 -0.108190 -0.059924 -0.338953 -0.358918 -0.200989 -0.224150 0.068016 -0.237393 -0.130074 0.242839 0.039368 -0.297552 -0.223170 0.349422 -0.113619 -0.262338 0.444422 0.348966 -0.285926 -0.224600 -0.118900 -0.149730 -0.206783 0.115288 0.112552 0.108650 0.104725 0.102715 0.092391 0.115346 0.104120 0.145160 0.147151 0.099859 0.107992 0.151074 0.143502 0.138757 0.143087 0.160589 0.145770 0.140433 0.161082 0.156947 0.160869 0.158606
qa: -0.0783 -0.1628 -0.1510 -0.3857 -0.2582 -0.3327 0.4003 -0.1082 -0.0599 -0.3390 -0.3589 -0.2010 -0.2241 0.0680 -0.2374 -0.1301 0.2428 0.0394 -0.2976 -0.2232 0.3494 -0.1136 -0.2623 0.4444 0.3490 -0.2859 -0.2246 -0.1189 -0.1497 -0.2068 0.1153 0.1126 0.1087 0.1047 0.1027 0.0924 0.1153 0.1041 0.1452 0.1472 0.0999 0.1080 0.1511 0.1435 0.1388 0.1431 0.1606 0.1458 0.1404 0.1611 0.1569 0.1609 0.1586
va: 1.1795 1.1271 1.1446 1.9206 2.1279 2.0526 3.5529 3.9604 3.6300 3.9182 3.9162 3.9496 4.0791 3.8957 3.9931 4.0006 3.6779 3.5926 3.9597 3.9588 3.5885 3.8727 4.0387 4.5434 3.5966 3.9367 3.8734 3.8187 3.8880 3.8417 0.9817 1.0040 1.0017 1.0033 1.0030 1.0127 0.9994 1.0045 1.0032 0.9975 0.9981 0.9895 1.0037 1.0193 1.0061 1.0011 0.9880 1.0069 1.0130 0.9968 0.9922 0.9893 0.9912
dispcorr: -0.034034501 hartree
energy: -3928.132807181362
dipole: -71.47937 69.33036 -2.14900 52.46835 -51.98114 0.48721 2.26148 -2.17003 0.09145
magnitude: 2.20544 au
magnitude: 5.60577 debye
