program: Orca
programVersion: 5.0.2
elementType: Br F F O O O C C C C C C C C C C C C C C C C C C C C C C C C H H H H H H H H H H H H H H H H H H H H H H H
charge: 0
multiplicity: 1
keywords: wb97x-d3
keywords: def2-TZVPP
keywords: def2/J RIJCOSX
keywords: DEFGRID2
keywords: scfconv7
keywords: smallprint printgap noloewdin
keywords: NOSOSCF
formula: C24H23BrF2O3
InChI: InChI=1/C24H23BrF2O3/c1-23(2,19-11-13-21(14-12-19)30-24(25,26)27)17-28-16-18-7-6-10-22(15-18)29-20-8-4-3-5-9-20/h3-15H,16-17H2,1-2H3
53 atoms
Br 2.126083 -3.493274 -1.889554
F  3.241477 -1.80846 -0.136127
F  3.731128 -1.359296 -2.180598
O  -4.011843 0.850364 -0.373711
O  1.802559 -0.762884 -1.477979
O  0.49672 3.186072 -0.303539
C  -3.387935 -1.129762 0.860208
C  -3.900536 0.313495 0.925995
C  -1.990025 -1.112304 0.252557
C  -4.350486 -2.001809 0.049066
C  -3.378487 -1.662466 2.295669
C  -0.85766 -0.942535 1.048291
C  -1.798306 -1.176637 -1.128515
C  -4.316939 2.221058 -0.400413
C  0.416379 -0.84913 0.505597
C  -0.535953 -1.080708 -1.691629
C  0.56096 -0.921488 -0.866225
C  -3.148835 3.115406 -0.063277
C  -1.838257 2.712973 -0.300558
C  -3.384584 4.389038 0.445854
C  -0.795297 3.584339 -0.030114
C  -2.331305 5.254753 0.7004
C  -1.022381 4.856527 0.468659
C  2.738259 -1.710514 -1.373653
C  1.208421 2.545455 0.67284
C  2.473348 2.095017 0.307297
C  0.734601 2.343292 1.963351
C  3.261219 1.436653 1.236851
C  1.538501 1.68097 2.883295
C  2.800025 1.22535 2.53131
H  -4.880303 0.329648 1.42417
H  -3.213563 0.909605 1.541659
H  -3.999142 -3.034321 0.014004
H  -5.33358 -2.004127 0.522968
H  -4.49146 -1.666971 -0.977129
H  -2.933684 -2.657234 2.342656
H  -4.400542 -1.739421 2.668959
H  -2.833543 -1.017528 2.985642
H  -0.946736 -0.870477 2.123465
H  -2.6371 -1.302715 -1.797655
H  -4.652134 2.442066 -1.417469
H  -5.158463 2.454256 0.264358
H  1.26547 -0.702287 1.159056
H  -0.411656 -1.120191 -2.766001
H  -1.618075 1.728811 -0.698043
H  -4.401488 4.707417 0.641865
H  -2.528255 6.243449 1.093351
H  -0.193029 5.521568 0.67234
H  2.831917 2.25936 -0.701128
H  -0.246921 2.684988 2.263634
H  4.242808 1.086682 0.945197
H  1.164206 1.522391 3.886333
H  3.416921 0.709654 3.25471
elementType: Br F O C H
totalener: -3928.10083652 hartree
nucrepener: 3618.55269205 hartree
electener: -7546.65352857 hartree
twoeener: 5088.31809203 hartree
cpcmener: -0.02584671 hartree
kineticenergy: 3918.78570708 hartree
xcener: -198.383148724225 hartree
chargesum: 0.0000000
charge: -0.073466 -0.161076 -0.151964 -0.384542 -0.286315 -0.340956 0.411227 -0.114979 0.007975 -0.357195 -0.345655 -0.259547 -0.233863 0.052895 -0.130215 -0.117336 0.115568 -0.017945 -0.172778 -0.178295 0.197838 -0.153730 -0.166837 0.438510 0.366219 -0.270690 -0.226644 -0.125506 -0.171220 -0.188809 0.111966 0.118245 0.112574 0.103071 0.095562 0.116703 0.105747 0.100124 0.149365 0.142723 0.109742 0.102783 0.163787 0.152015 0.136414 0.144948 0.161113 0.151430 0.143288 0.147232 0.154079 0.159717 0.156707
qa: -0.0735 -0.1611 -0.1520 -0.3845 -0.2863 -0.3410 0.4112 -0.1150 0.0080 -0.3572 -0.3457 -0.2595 -0.2339 0.0529 -0.1302 -0.1173 0.1156 -0.0179 -0.1728 -0.1783 0.1978 -0.1537 -0.1668 0.4385 0.3662 -0.2707 -0.2266 -0.1255 -0.1712 -0.1888 0.1120 0.1182 0.1126 0.1031 0.0956 0.1167 0.1057 0.1001 0.1494 0.1427 0.1097 0.1028 0.1638 0.1520 0.1364 0.1449 0.1611 0.1514 0.1433 0.1472 0.1541 0.1597 0.1567
va: 1.1862 1.1315 1.1447 1.9345 2.0719 2.0529 3.5161 3.9666 3.5767 3.9214 3.9148 4.0075 4.0202 3.9016 3.9469 4.0028 3.7541 3.6116 3.9608 3.9187 3.7729 3.8925 3.9493 4.5579 3.5597 3.9297 3.8252 3.8292 3.8869 3.8646 1.0022 0.9827 0.9997 1.0030 1.0117 1.0003 1.0046 1.0016 1.0004 1.0041 0.9896 0.9976 1.0045 1.0015 1.0075 0.9985 0.9888 1.0001 1.0144 1.0077 0.9935 0.9905 0.9910
dispcorr: -0.034585272 hartree
energy: -3928.135421793791
dipole: -65.08001 62.89893 -2.18109 50.17637 -49.67559 0.50078 39.53420 -37.95084 1.58336
magnitude: 2.74134 au
magnitude: 6.96793 debye
