program: Orca
programVersion: 5.0.2
elementType: Br F F O O O C C C C C C C C C C C C C C C C C C C C C C C C H H H H H H H H H H H H H H H H H H H H H H H
charge: 0
multiplicity: 1
keywords: wb97x-d3
keywords: def2-TZVPP
keywords: def2/J RIJCOSX
keywords: DEFGRID2
keywords: scfconv7
keywords: smallprint printgap noloewdin
keywords: NOSOSCF
formula: C24H23BrF2O3
InChI: InChI=1/C24H23BrF2O3/c1-23(2,19-11-13-21(14-12-19)30-24(25,26)27)17-28-16-18-7-6-10-22(15-18)29-20-8-4-3-5-9-20/h3-15H,16-17H2,1-2H3
53 atoms
Br 2.945671 -2.68193 1.218217
F  3.048841 -2.000089 -1.364245
F  3.675992 -4.023421 -0.992771
O  -4.098872 1.238149 0.895089
O  1.570702 -3.629055 -1.010836
O  0.243597 4.428214 -0.584738
C  -3.314807 -0.938953 0.213271
C  -2.933971 0.485424 0.636676
C  -2.005478 -1.659211 -0.094446
C  -4.190171 -0.910324 -1.046997
C  -4.094889 -1.620852 1.336447
C  -1.560015 -2.75065 0.647137
C  -1.205216 -1.232796 -1.157759
C  -3.842818 2.540038 1.386027
C  -0.366007 -3.392428 0.349308
C  -0.008177 -1.857704 -1.471052
C  0.402507 -2.931535 -0.700619
C  -3.153661 3.399527 0.360545
C  -1.776445 3.568425 0.418798
C  -3.867561 3.943986 -0.703735
C  -1.11549 4.24273 -0.599323
C  -3.203052 4.648394 -1.695935
C  -1.822321 4.790328 -1.659043
C  2.76105 -3.11553 -0.682218
C  1.060969 3.42955 -0.115827
C  2.175034 3.818924 0.61394
C  0.830671 2.086878 -0.394922
C  3.066094 2.85644 1.067599
C  1.72224 1.135877 0.078645
C  2.841169 1.511516 0.809817
H  -2.297436 0.445262 1.53306
H  -2.339726 0.954512 -0.156943
H  -4.363625 -1.922872 -1.414584
H  -5.16471 -0.468234 -0.837888
H  -3.73556 -0.335206 -1.854995
H  -3.545116 -1.619286 2.279299
H  -4.33208 -2.655928 1.085358
H  -5.041216 -1.109494 1.508635
H  -2.140511 -3.128515 1.476235
H  -1.514132 -0.398586 -1.774551
H  -4.815046 2.961071 1.647459
H  -3.240961 2.494285 2.302466
H  -0.047165 -4.246475 0.932093
H  0.573405 -1.515732 -2.316386
H  -1.22557 3.151108 1.253573
H  -4.942104 3.818454 -0.755595
H  -3.758103 5.078851 -2.519008
H  -1.299797 5.321086 -2.444463
H  2.343638 4.867663 0.82265
H  -0.029231 1.775148 -0.975025
H  3.934331 3.16369 1.63545
H  1.534083 0.09259 -0.135902
H  3.534371 0.764639 1.172966
elementType: Br F O C H
totalener: -3928.09905735 hartree
nucrepener: 3521.27688807 hartree
electener: -7449.37594542 hartree
twoeener: 4989.16808400 hartree
cpcmener: -0.02609786 hartree
kineticenergy: 3918.77096803 hartree
xcener: -198.376989312249 hartree
chargesum: 0.0000000
charge: -0.082539 -0.156612 -0.147821 -0.386371 -0.278769 -0.342549 0.431082 -0.067853 -0.063519 -0.357141 -0.379296 -0.151884 -0.228811 0.052789 -0.155599 -0.199221 0.185745 0.024029 -0.203218 -0.255069 0.285824 -0.116288 -0.257389 0.434750 0.324875 -0.274110 -0.264898 -0.099365 -0.018414 -0.224846 0.104104 0.094934 0.112516 0.097189 0.100868 0.103091 0.110252 0.097850 0.150400 0.153599 0.110549 0.102793 0.151304 0.157841 0.148298 0.145439 0.161386 0.148561 0.146271 0.165931 0.161254 0.102464 0.145595
qa: -0.0825 -0.1566 -0.1478 -0.3864 -0.2788 -0.3425 0.4311 -0.0679 -0.0635 -0.3571 -0.3793 -0.1519 -0.2288 0.0528 -0.1556 -0.1992 0.1857 0.0240 -0.2032 -0.2551 0.2858 -0.1163 -0.2574 0.4348 0.3249 -0.2741 -0.2649 -0.0994 -0.0184 -0.2248 0.1041 0.0949 0.1125 0.0972 0.1009 0.1031 0.1103 0.0978 0.1504 0.1536 0.1105 0.1028 0.1513 0.1578 0.1483 0.1454 0.1614 0.1486 0.1463 0.1659 0.1613 0.1025 0.1456
va: 1.1719 1.1277 1.1486 1.9270 2.0990 2.0712 3.4796 3.9883 3.6467 3.9338 3.9378 3.9273 3.9735 3.9058 4.0194 3.9748 3.7131 3.5158 3.8645 3.9732 3.7022 3.8830 4.0167 4.5458 3.6784 4.0308 3.9748 3.8994 3.7730 3.9631 1.0021 0.9866 1.0001 1.0127 1.0037 0.9995 0.9987 1.0190 0.9966 0.9958 0.9916 0.9992 1.0038 1.0053 1.0039 1.0035 0.9870 1.0057 1.0081 0.9912 0.9878 1.0067 0.9991
dispcorr: -0.031794956 hartree
energy: -3928.130852307301
dipole: -72.95502 71.91251 -1.04251 47.22015 -47.04223 0.17792 -7.15472 7.58113 0.42641
magnitude: 1.14030 au
magnitude: 2.89842 debye
