program: Orca
programVersion: 5.0.2
elementType: Br F F O O O C C C C C C C C C C C C C C C C C C C C C C C C H H H H H H H H H H H H H H H H H H H H H H H
charge: 0
multiplicity: 1
keywords: wb97x-d3
keywords: def2-TZVPP
keywords: def2/J RIJCOSX
keywords: DEFGRID2
keywords: scfconv7
keywords: smallprint printgap noloewdin
keywords: NOSOSCF
formula: C24H23BrF2O3
InChI: InChI=1/C24H23BrF2O3/c1-23(2,19-11-13-21(14-12-19)30-24(25,26)27)17-28-16-18-7-6-10-22(15-18)29-20-8-4-3-5-9-20/h3-15H,16-17H2,1-2H3
53 atoms
Br 2.816634 -2.700577 0.960304
F  3.733797 -2.200682 -1.512266
F  2.142515 -3.650539 -1.447232
O  -4.3469 0.693084 -0.838992
O  1.732194 -1.472402 -1.287412
O  0.35662 3.884506 0.792955
C  -3.689372 -1.322064 0.469961
C  -4.170377 0.140261 0.449664
C  -2.244154 -1.420489 0.000638
C  -4.636728 -2.179076 -0.365604
C  -3.775976 -1.796694 1.926864
C  -1.245633 -0.72186 0.683646
C  -1.863823 -2.1637 -1.113552
C  -3.227466 1.320681 -1.431915
C  0.073933 -0.748877 0.269222
C  -0.542704 -2.211182 -1.54187
C  0.412742 -1.503026 -0.840621
C  -2.742333 2.529594 -0.673303
C  -1.404041 2.615018 -0.306331
C  -3.616044 3.561699 -0.345617
C  -0.935892 3.736289 0.368602
C  -3.140916 4.672883 0.335205
C  -1.804112 4.771332 0.691824
C  2.556988 -2.473849 -0.964052
C  1.335289 2.999413 0.40231
C  1.664847 2.828515 -0.936295
C  2.032461 2.331283 1.397488
C  2.696733 1.964254 -1.273784
C  3.071455 1.477918 1.04685
C  3.401656 1.285587 -0.286944
H  -5.155063 0.170095 0.925092
H  -3.508631 0.763392 1.062983
H  -4.377746 -3.237177 -0.300036
H  -5.65644 -2.070755 0.008096
H  -4.64374 -1.904609 -1.420566
H  -3.423809 -2.824949 2.019218
H  -4.809947 -1.7665 2.275793
H  -3.182451 -1.17928 2.602528
H  -1.493423 -0.117901 1.547588
H  -2.597737 -2.715119 -1.683956
H  -2.39674 0.625199 -1.583362
H  -3.562978 1.627381 -2.425474
H  0.822946 -0.170082 0.794454
H  -0.280557 -2.777465 -2.425724
H  -0.743308 1.7945 -0.552503
H  -4.660233 3.505917 -0.626547
H  -3.814808 5.481089 0.587669
H  -1.438474 5.640952 1.223101
H  1.122913 3.359709 -1.708956
H  1.767542 2.479642 2.436796
H  2.951232 1.824689 -2.316295
H  3.618123 0.959012 1.823367
H  4.207981 0.616863 -0.557416
elementType: Br F O C H
totalener: -3928.09698090 hartree
nucrepener: 3621.69333323 hartree
electener: -7549.79031413 hartree
twoeener: 5089.97446637 hartree
cpcmener: -0.02464181 hartree
kineticenergy: 3918.78151254 hartree
xcener: -198.384849445161 hartree
chargesum: 0.0000000
charge: -0.079586 -0.150805 -0.157625 -0.402588 -0.280414 -0.338625 0.393049 -0.074012 -0.086243 -0.385218 -0.344568 -0.252424 -0.155065 0.107688 -0.176264 -0.142061 0.189368 -0.023286 -0.216635 -0.267384 0.342680 -0.108553 -0.275671 0.440544 0.300492 -0.198056 -0.243735 -0.144926 -0.102511 -0.186933 0.118899 0.110821 0.109937 0.105915 0.096959 0.108044 0.104755 0.105726 0.140636 0.146371 0.090221 0.118127 0.163278 0.152061 0.133494 0.138030 0.159045 0.146541 0.158412 0.144917 0.161035 0.152224 0.153922
qa: -0.0796 -0.1508 -0.1576 -0.4026 -0.2804 -0.3386 0.3930 -0.0740 -0.0862 -0.3852 -0.3446 -0.2524 -0.1551 0.1077 -0.1763 -0.1421 0.1894 -0.0233 -0.2166 -0.2674 0.3427 -0.1086 -0.2757 0.4405 0.3005 -0.1981 -0.2437 -0.1449 -0.1025 -0.1869 0.1189 0.1108 0.1099 0.1059 0.0970 0.1080 0.1048 0.1057 0.1406 0.1464 0.0902 0.1181 0.1633 0.1521 0.1335 0.1380 0.1590 0.1465 0.1584 0.1449 0.1610 0.1522 0.1539
va: 1.1811 1.1433 1.1368 1.9136 2.0753 2.0804 3.5332 3.9381 3.6192 3.9360 3.9277 4.0528 3.8979 3.8541 3.9408 4.0743 3.7315 3.6367 3.8861 3.9849 3.6677 3.8948 3.9942 4.5577 3.6218 3.9016 3.9883 3.8448 3.8119 3.8283 1.0078 0.9912 0.9992 1.0049 1.0109 1.0023 1.0041 1.0000 1.0080 0.9973 0.9891 0.9904 0.9975 1.0059 0.9955 1.0134 0.9877 1.0088 0.9958 1.0076 0.9901 0.9946 0.9993
dispcorr: -0.034869940 hartree
energy: -3928.131850838063
dipole: -70.27404 69.51289 -0.76116 40.67426 -40.88709 -0.21283 -4.07567 4.38413 0.30845
magnitude: 0.84841 au
magnitude: 2.15649 debye
