program: Orca
programVersion: 5.0.2
elementType: O O O O N N C C C C C C C C C C C C C C C C C H H H H H H H H H H H H H H H H H H H H H H
charge: 0
multiplicity: 1
keywords: wb97x-d3
keywords: def2-TZVPP
keywords: def2/J RIJCOSX
keywords: DEFGRID2
keywords: scfconv7
keywords: smallprint printgap noloewdin
keywords: NOSOSCF
formula: C17H22N2O4
InChI: InChI=1/C17H22N2O4/c1-6-7-18-9-13(20)19(16(18)22)10-23-15(21)14-12(8-11(2)3)17(14,4)5/h1,8,12,14H,7,9-10H2,2-5H3
45 atoms
O  0.305153 1.322157 0.698799
O  -0.542267 2.9194 -0.630933
O  1.23835 0.016972 -2.091435
O  3.498794 0.034841 1.864653
N  2.265621 0.372975 -0.067574
N  3.477208 -1.467116 0.116994
C  -3.264994 2.196241 0.702034
C  -3.130883 1.367377 -0.528702
C  -2.000352 1.383499 0.486399
C  -4.158526 1.697237 1.813544
C  -3.254413 3.700393 0.579427
C  -3.93411 0.134161 -0.732091
C  -0.709124 1.985801 0.104887
C  -3.478844 -1.025857 -1.207719
C  -4.386749 -2.207642 -1.369769
C  -2.055053 -1.255856 -1.6125
C  1.626906 1.603134 0.287257
C  1.979762 -0.326795 -1.214112
C  3.131436 -0.330232 0.780961
C  2.784039 -1.608339 -1.132635
C  4.275587 -2.509721 0.704018
C  3.512225 -3.735542 0.925099
C  2.881349 -4.743791 1.078623
H  -2.911887 1.93581 -1.429963
H  -1.912932 0.496858 1.103289
H  -5.193255 1.999441 1.639121
H  -4.142258 0.611402 1.906458
H  -3.849374 2.118419 2.771369
H  -2.870767 4.164792 1.489692
H  -2.654415 4.053465 -0.254477
H  -4.275249 4.058752 0.433472
H  -4.990185 0.207926 -0.485824
H  -5.403194 -1.994485 -1.040733
H  -4.430944 -2.5283 -2.413551
H  -4.019963 -3.063748 -0.797434
H  -1.452972 -0.352011 -1.61626
H  -1.574716 -1.979159 -0.947097
H  -2.007236 -1.682799 -2.616851
H  1.636384 2.281881 -0.564231
H  2.177749 2.042394 1.117218
H  2.116085 -2.47523 -1.145833
H  3.462074 -1.690365 -1.987091
H  4.672064 -2.136395 1.649287
H  5.135005 -2.729202 0.062885
H  2.323663 -5.636568 1.231174
totalener: -1071.51797075 hartree
nucrepener: 1957.45050317 hartree
electener: -3028.96847392 hartree
oneelecener: -5346.96612619 hartree
twoeener: 2317.99765226 hartree
kineticenergy: 1066.93562708 hartree
xcener: -102.626753130886 hartree
chargesum: -0.0000000
charge: -0.272181 -0.378662 -0.347998 -0.383008 -0.133836 -0.168874 0.135287 -0.010899 -0.138084 -0.267451 -0.261869 -0.247073 0.352482 0.001758 -0.213158 -0.220895 0.061725 0.231250 0.342097 -0.011751 -0.087121 -0.400024 0.105023 0.108660 0.090462 0.088725 0.085527 0.092028 0.084295 0.104043 0.082035 0.092376 0.078345 0.088045 0.082859 0.093860 0.078520 0.089706 0.141558 0.118836 0.108081 0.102884 0.129891 0.124183 0.248346
qa: -0.2722 -0.3787 -0.3480 -0.3830 -0.1338 -0.1689 0.1353 -0.0109 -0.1381 -0.2675 -0.2619 -0.2471 0.3525 0.0018 -0.2132 -0.2209 0.0617 0.2312 0.3421 -0.0118 -0.0871 -0.4000 0.1050 0.1087 0.0905 0.0887 0.0855 0.0920 0.0843 0.1040 0.0820 0.0924 0.0783 0.0880 0.0829 0.0939 0.0785 0.0897 0.1416 0.1188 0.1081 0.1029 0.1299 0.1242 0.2483
va: 2.0980 2.1230 2.1594 2.1436 3.1112 3.1411 3.7246 3.8172 3.8556 3.9077 3.9038 3.9032 4.1647 3.7403 3.9419 3.9404 3.8941 4.2326 4.3414 3.8981 3.9086 3.7803 3.6316 1.0229 1.0307 1.0021 1.0053 1.0063 1.0024 1.0224 1.0013 1.0099 1.0099 0.9990 0.9989 1.0161 0.9999 1.0042 1.0135 1.0115 1.0096 1.0081 1.0119 0.9830 0.9708
dispcorr: -0.021968382 hartree
energy: -1071.539939129420
dipole: -28.18593 28.48620 0.30027 -2.54627 1.03754 -1.50873 -1.27368 1.24712 -0.02656
magnitude: 1.53855 au
magnitude: 3.91067 debye
