program: Orca
programVersion: 5.0.2
elementType: O O O O N N C C C C C C C C C C C C C C C C C H H H H H H H H H H H H H H H H H H H H H H
charge: 0
multiplicity: 1
keywords: wb97x-d3
keywords: def2-TZVPP
keywords: def2/J RIJCOSX
keywords: DEFGRID2
keywords: scfconv7
keywords: smallprint printgap noloewdin
keywords: NOSOSCF
formula: C17H22N2O4
InChI: InChI=1/C17H22N2O4/c1-6-7-18-9-13(20)19(16(18)22)10-23-15(21)14-12(8-11(2)3)17(14,4)5/h1,8,12,14H,7,9-10H2,2-5H3
45 atoms
O  0.332982 1.909184 1.073879
O  0.297485 -0.314326 1.348941
O  3.45546 -0.210711 2.15401
O  1.908708 2.009598 -1.516781
N  2.520231 1.143644 0.540236
N  3.266022 0.158854 -1.295712
C  -2.119568 0.238466 -0.686629
C  -2.568669 -0.366703 0.614456
C  -1.672914 0.842625 0.632428
C  -3.095049 1.054632 -1.499138
C  -1.130844 -0.519832 -1.537735
C  -3.958764 -0.251991 1.101088
C  -0.267124 0.708673 1.068448
C  -4.780146 -1.259501 1.402349
C  -6.169493 -0.996758 1.901896
C  -4.424819 -2.709628 1.27576
C  1.711757 1.984445 1.370531
C  3.231023 0.057579 1.010029
C  2.494275 1.194234 -0.855351
C  3.69369 -0.693411 -0.220267
C  3.283692 -0.252862 -2.673752
C  2.461519 -1.43721 -2.916072
C  1.800752 -2.422884 -3.091324
H  -2.056307 -1.287355 0.872704
H  -2.126949 1.798813 0.871707
H  -3.71632 0.40181 -2.114757
H  -3.764079 1.653695 -0.883013
H  -2.560769 1.734773 -2.164227
H  -0.473905 -1.16414 -0.956767
H  -1.663837 -1.152416 -2.250105
H  -0.50437 0.166401 -2.110892
H  -4.339893 0.757441 1.227763
H  -6.386605 0.068509 1.970799
H  -6.916641 -1.449724 1.245197
H  -6.320478 -1.433617 2.89234
H  -4.536316 -3.221915 2.234491
H  -5.101961 -3.208295 0.577664
H  -3.410077 -2.880709 0.924125
H  1.967677 3.030083 1.215959
H  1.916764 1.704707 2.404947
H  4.775913 -0.842168 -0.201028
H  3.211253 -1.676351 -0.249572
H  4.312459 -0.454026 -2.984958
H  2.926959 0.581427 -3.278988
H  1.207125 -3.290461 -3.25245
totalener: -1071.51571194 hartree
nucrepener: 2000.73088547 hartree
electener: -3072.24659740 hartree
oneelecener: -5433.72122874 hartree
twoeener: 2361.47463133 hartree
kineticenergy: 1066.94226338 hartree
xcener: -102.629060805972 hartree
chargesum: 0.0000000
charge: -0.251749 -0.378623 -0.331921 -0.373712 -0.145213 -0.152184 0.135215 0.034024 -0.097782 -0.246677 -0.286532 -0.194928 0.330778 -0.045383 -0.206364 -0.235931 0.084063 0.246782 0.291577 -0.030277 -0.080612 -0.391327 0.085220 0.091814 0.072227 0.089829 0.069854 0.099379 0.084020 0.087284 0.096324 0.074115 0.076566 0.083052 0.085606 0.087214 0.084444 0.081940 0.123701 0.129185 0.104150 0.117727 0.123277 0.132613 0.247237
qa: -0.2517 -0.3786 -0.3319 -0.3737 -0.1452 -0.1522 0.1352 0.0340 -0.0978 -0.2467 -0.2865 -0.1949 0.3308 -0.0454 -0.2064 -0.2359 0.0841 0.2468 0.2916 -0.0303 -0.0806 -0.3913 0.0852 0.0918 0.0722 0.0898 0.0699 0.0994 0.0840 0.0873 0.0963 0.0741 0.0766 0.0831 0.0856 0.0872 0.0844 0.0819 0.1237 0.1292 0.1041 0.1177 0.1233 0.1326 0.2472
va: 2.1342 2.1280 2.1881 2.1476 3.0911 3.1283 3.7465 3.7911 3.8763 3.9070 3.9096 3.8980 4.2679 3.8099 3.9371 3.9470 3.9145 4.2449 4.3972 3.8852 3.9128 3.7621 3.6672 1.0329 1.0377 1.0045 1.0105 1.0035 1.0158 1.0047 1.0098 1.0195 1.0122 0.9984 0.9980 0.9992 0.9994 1.0146 0.9929 1.0143 1.0106 1.0077 0.9851 1.0083 0.9723
dispcorr: -0.023502898 hartree
energy: -1071.539214833213
dipole: -31.68198 31.58533 -0.09665 -9.75630 9.42814 -0.32816 -3.52894 2.67459 -0.85434
magnitude: 0.92029 au
magnitude: 2.33919 debye
