program: Orca
programVersion: 5.0.2
elementType: O O O O N N C C C C C C C C C C C C C C C C C H H H H H H H H H H H H H H H H H H H H H H
charge: 0
multiplicity: 1
keywords: wb97x-d3
keywords: def2-TZVPP
keywords: def2/J RIJCOSX
keywords: DEFGRID2
keywords: scfconv7
keywords: smallprint printgap noloewdin
keywords: NOSOSCF
formula: C17H22N2O4
InChI: InChI=1/C17H22N2O4/c1-6-7-18-9-13(20)19(16(18)22)10-23-15(21)14-12(8-11(2)3)17(14,4)5/h1,8,12,14H,7,9-10H2,2-5H3
45 atoms
O  0.466264 1.425044 1.154854
O  -0.070398 1.312077 -1.014497
O  3.005286 1.556286 -1.834423
O  2.246041 -1.018376 1.850224
N  2.428942 0.548787 0.158313
N  2.953272 -1.554099 -0.277779
C  -2.974312 1.743323 0.099083
C  -2.759032 0.296189 -0.215242
C  -1.76019 1.015813 0.656141
C  -4.028053 2.115571 1.113605
C  -2.826023 2.759422 -1.006236
C  -3.595566 -0.785219 0.367041
C  -0.399064 1.264586 0.140198
C  -4.808011 -1.122992 -0.073572
C  -5.582812 -2.245709 0.54633
C  -5.486314 -0.428227 -1.214448
C  1.826128 1.649632 0.844225
C  2.890612 0.588677 -1.140723
C  2.516661 -0.73083 0.715411
C  3.267874 -0.838785 -1.48371
C  3.326663 -2.922585 -0.046091
C  4.772592 -3.128348 -0.101299
C  5.959739 -3.28564 -0.170675
H  -2.396182 0.110597 -1.223575
H  -1.802874 0.804591 1.719186
H  -4.097888 1.396916 1.92886
H  -3.815103 3.095439 1.544227
H  -5.011122 2.16707 0.641215
H  -2.508629 3.72605 -0.610473
H  -2.111892 2.457927 -1.768103
H  -3.791778 2.908795 -1.493831
H  -3.169917 -1.344424 1.195199
H  -5.803513 -3.024028 -0.188398
H  -5.044302 -2.708495 1.372295
H  -6.545615 -1.894998 0.926155
H  -6.461953 -0.041876 -0.909302
H  -4.905162 0.403352 -1.60807
H  -5.67287 -1.124625 -2.035966
H  1.959059 2.53417 0.220144
H  2.306445 1.801124 1.807939
H  2.686834 -1.184108 -2.343621
H  4.329321 -0.89954 -1.742488
H  2.839647 -3.569558 -0.781607
H  2.944341 -3.212701 0.933498
H  7.012237 -3.429796 -0.21844
totalener: -1071.51676927 hartree
nucrepener: 1941.19791491 hartree
electener: -3012.71468418 hartree
oneelecener: -5314.60638218 hartree
twoeener: 2301.89169800 hartree
kineticenergy: 1066.94699742 hartree
xcener: -102.628667040218 hartree
chargesum: 0.0000000
charge: -0.260843 -0.387244 -0.329661 -0.376230 -0.157119 -0.166444 0.069345 -0.035797 -0.095564 -0.244012 -0.265314 -0.190592 0.346999 -0.024833 -0.210227 -0.242838 0.090398 0.249904 0.322872 -0.029375 -0.088760 -0.400911 0.104064 0.107684 0.086174 0.084179 0.096335 0.085232 0.089219 0.107203 0.080731 0.095012 0.085859 0.080139 0.084197 0.087443 0.082998 0.098225 0.128614 0.127515 0.103566 0.110574 0.124502 0.128766 0.248015
qa: -0.2608 -0.3872 -0.3297 -0.3762 -0.1571 -0.1664 0.0693 -0.0358 -0.0956 -0.2440 -0.2653 -0.1906 0.3470 -0.0248 -0.2102 -0.2428 0.0904 0.2499 0.3229 -0.0294 -0.0888 -0.4009 0.1041 0.1077 0.0862 0.0842 0.0963 0.0852 0.0892 0.1072 0.0807 0.0950 0.0859 0.0801 0.0842 0.0874 0.0830 0.0982 0.1286 0.1275 0.1036 0.1106 0.1245 0.1288 0.2480
va: 2.1298 2.1097 2.1920 2.1527 3.0916 3.1351 3.7238 3.8282 3.8310 3.9101 3.9059 3.8536 4.2383 3.7361 3.9391 3.9370 3.9137 4.2441 4.3673 3.8915 3.9191 3.7819 3.6306 1.0253 1.0347 1.0070 1.0060 1.0019 1.0033 1.0203 1.0019 1.0125 0.9982 1.0106 0.9990 0.9994 1.0110 1.0032 1.0152 0.9936 1.0084 1.0098 0.9832 1.0115 0.9709
dispcorr: -0.021623361 hartree
energy: -1071.538392627147
dipole: -37.20608 36.80398 -0.40211 -0.17836 -0.58146 -0.75982 -1.59363 1.53522 -0.05840
magnitude: 0.86164 au
magnitude: 2.19012 debye
