program: Orca
programVersion: 5.0.2
elementType: O O O O N N C C C C C C C C C C C C C C C C C H H H H H H H H H H H H H H H H H H H H H H
charge: 0
multiplicity: 1
keywords: wb97x-d3
keywords: def2-TZVPP
keywords: def2/J RIJCOSX
keywords: DEFGRID2
keywords: scfconv7
keywords: smallprint printgap noloewdin
keywords: NOSOSCF
formula: C17H22N2O4
InChI: InChI=1/C17H22N2O4/c1-6-7-18-9-13(20)19(16(18)22)10-23-15(21)14-12(8-11(2)3)17(14,4)5/h1,8,12,14H,7,9-10H2,2-5H3
45 atoms
O  0.365648 0.736806 0.932543
O  -0.743486 -0.817045 2.107815
O  3.866354 2.064337 0.861466
O  1.576994 -1.488559 -0.845865
N  2.527081 0.27437 0.310288
N  3.301356 -0.218384 -1.703568
C  -2.655511 -0.558571 -0.384116
C  -3.281347 0.04761 0.837397
C  -1.883306 0.458677 0.438625
C  -3.095082 -0.105705 -1.755632
C  -2.264963 -2.016618 -0.34693
C  -4.370682 1.038756 0.7707
C  -0.735385 0.034542 1.262405
C  -5.498841 1.03908 1.484049
C  -6.50792 2.135991 1.318335
C  -5.873091 -0.003113 2.493875
C  1.611506 0.272355 1.409002
C  3.538557 1.184473 0.11669
C  2.37912 -0.597121 -0.774054
C  4.160875 0.826273 -1.218311
C  3.624586 -1.030231 -2.846647
C  4.867009 -1.778298 -2.665005
C  5.896977 -2.369939 -2.498993
H  -3.302642 -0.619079 1.69223
H  -1.768615 1.432049 -0.026055
H  -4.002547 -0.631727 -2.057106
H  -3.302621 0.962195 -1.809246
H  -2.320894 -0.326999 -2.492166
H  -2.054584 -2.37414 0.657858
H  -3.078159 -2.622171 -0.75112
H  -1.377247 -2.196222 -0.955888
H  -4.226456 1.857616 0.071698
H  -6.198746 2.869997 0.575043
H  -7.478279 1.736429 1.012747
H  -6.671957 2.663865 2.261312
H  -5.153379 -0.814301 2.574622
H  -5.984209 0.442433 3.485579
H  -6.839834 -0.446859 2.244061
H  1.998836 0.948976 2.169815
H  1.522134 -0.731107 1.822171
H  4.180419 1.698323 -1.877033
H  5.192135 0.487371 -1.072222
H  3.703708 -0.398594 -3.735543
H  2.794808 -1.71696 -3.018438
H  6.803591 -2.906768 -2.353936
totalener: -1071.51921383 hartree
nucrepener: 1913.03427799 hartree
electener: -2984.55349182 hartree
oneelecener: -5258.12323299 hartree
twoeener: 2273.56974117 hartree
kineticenergy: 1066.94926106 hartree
xcener: -102.629178273162 hartree
chargesum: 0.0000000
charge: -0.273944 -0.375356 -0.343323 -0.388907 -0.132513 -0.167212 0.086735 0.042169 -0.072034 -0.250035 -0.247421 -0.189351 0.336108 -0.049651 -0.203656 -0.237140 0.061498 0.236381 0.352811 -0.031134 -0.082815 -0.402332 0.104230 0.088147 0.069417 0.092600 0.069465 0.092548 0.094671 0.083293 0.093962 0.069549 0.075187 0.083190 0.084578 0.084272 0.087791 0.083554 0.117746 0.140798 0.103646 0.109986 0.123631 0.129964 0.248898
qa: -0.2739 -0.3754 -0.3433 -0.3889 -0.1325 -0.1672 0.0867 0.0422 -0.0720 -0.2500 -0.2474 -0.1894 0.3361 -0.0497 -0.2037 -0.2371 0.0615 0.2364 0.3528 -0.0311 -0.0828 -0.4023 0.1042 0.0881 0.0694 0.0926 0.0695 0.0925 0.0947 0.0833 0.0940 0.0695 0.0752 0.0832 0.0846 0.0843 0.0878 0.0836 0.1177 0.1408 0.1036 0.1100 0.1236 0.1300 0.2489
va: 2.1020 2.1293 2.1767 2.1256 3.1052 3.1305 3.7572 3.7991 3.8614 3.9127 3.9094 3.9067 4.2265 3.8241 3.9351 3.9456 3.8958 4.2531 4.3163 3.8959 3.9224 3.7796 3.6384 1.0361 1.0373 1.0044 1.0103 1.0041 1.0217 1.0006 1.0104 1.0214 1.0125 0.9985 0.9979 1.0153 0.9985 0.9995 1.0129 1.0126 1.0106 1.0086 0.9842 1.0094 0.9705
dispcorr: -0.020449527 hartree
energy: -1071.539663358694
dipole: -35.37298 35.77973 0.40675 -0.04652 0.20239 0.15587 -1.41073 0.05506 -1.35568
magnitude: 1.42394 au
magnitude: 3.61937 debye
