program: Orca
programVersion: 5.0.2
elementType: O O O O N N C C C C C C C C C C C C C C C C C H H H H H H H H H H H H H H H H H H H H H H
charge: 0
multiplicity: 1
keywords: wb97x-d3
keywords: def2-TZVPP
keywords: def2/J RIJCOSX
keywords: DEFGRID2
keywords: scfconv7
keywords: smallprint printgap noloewdin
keywords: NOSOSCF
formula: C17H22N2O4
InChI: InChI=1/C17H22N2O4/c1-6-7-18-9-13(20)19(16(18)22)10-23-15(21)14-12(8-11(2)3)17(14,4)5/h1,8,12,14H,7,9-10H2,2-5H3
45 atoms
O  -0.289977 -0.724864 -0.058356
O  -1.762821 -0.738714 -1.749663
O  1.584816 1.191612 -1.708268
O  2.907246 -2.428056 0.72381
N  1.945058 -0.784902 -0.593622
N  3.912714 -0.390239 0.335553
C  -2.576212 1.942404 -0.260595
C  -3.636746 0.899471 -0.143729
C  -2.213029 0.543392 0.216722
C  -2.487986 3.022467 0.79024
C  -2.153865 2.409561 -1.632187
C  -4.692049 0.956218 0.900142
C  -1.441274 -0.362409 -0.655568
C  -5.280879 -0.103197 1.456649
C  -6.370211 0.052746 2.473966
C  -4.921666 -1.516715 1.115356
C  0.678359 -1.401226 -0.835257
C  2.265708 0.478676 -1.026423
C  2.936685 -1.33443 0.227725
C  3.643606 0.770806 -0.46772
C  5.202827 -0.668291 0.90866
C  6.252015 -0.767042 -0.103862
C  7.102648 -0.822978 -0.947596
H  -3.954019 0.480712 -1.09577
H  -1.97633 0.466996 1.27201
H  -3.156782 3.851345 0.548702
H  -2.75161 2.66211 1.784687
H  -1.473923 3.4221 0.839928
H  -2.745649 3.280389 -1.920475
H  -1.102354 2.701395 -1.640577
H  -2.292947 1.649879 -2.397706
H  -5.028187 1.94516 1.198571
H  -7.298051 -0.409982 2.128666
H  -6.106449 -0.442656 3.411714
H  -6.579779 1.098871 2.693795
H  -4.58292 -2.056101 2.003542
H  -5.79561 -2.056292 0.742059
H  -4.141158 -1.588238 0.360929
H  0.744205 -2.443044 -0.52467
H  0.434238 -1.348718 -1.895166
H  4.364503 0.892886 -1.282761
H  3.631461 1.695183 0.115813
H  5.128236 -1.602682 1.466396
H  5.464218 0.111851 1.629192
H  7.860354 -0.887064 -1.691216
totalener: -1071.51871819 hartree
nucrepener: 1916.75807700 hartree
electener: -2988.27679519 hartree
oneelecener: -5265.59132751 hartree
twoeener: 2277.31453232 hartree
kineticenergy: 1066.94255509 hartree
xcener: -102.627448693203 hartree
chargesum: -0.0000000
charge: -0.270848 -0.376090 -0.348484 -0.383209 -0.132240 -0.172084 0.128476 -0.026895 -0.100299 -0.279612 -0.245242 -0.232551 0.340649 -0.005489 -0.212245 -0.227118 0.056217 0.238853 0.342658 -0.018735 -0.086277 -0.398904 0.102883 0.106437 0.083859 0.090835 0.083388 0.091855 0.082557 0.093790 0.095500 0.092808 0.086928 0.084309 0.077897 0.085784 0.089314 0.082033 0.122158 0.140591 0.110515 0.102579 0.131384 0.123381 0.248686
qa: -0.2708 -0.3761 -0.3485 -0.3832 -0.1322 -0.1721 0.1285 -0.0269 -0.1003 -0.2796 -0.2452 -0.2326 0.3406 -0.0055 -0.2122 -0.2271 0.0562 0.2389 0.3427 -0.0187 -0.0863 -0.3989 0.1029 0.1064 0.0839 0.0908 0.0834 0.0919 0.0826 0.0938 0.0955 0.0928 0.0869 0.0843 0.0779 0.0858 0.0893 0.0820 0.1222 0.1406 0.1105 0.1026 0.1314 0.1234 0.2487
va: 2.1003 2.1233 2.1630 2.1437 3.1091 3.1402 3.7678 3.8355 3.8198 3.9095 3.8963 3.8983 4.1878 3.7319 3.9413 3.9421 3.8940 4.2368 4.3417 3.8898 3.9195 3.7737 3.6384 1.0258 1.0314 1.0013 1.0044 1.0067 1.0017 1.0089 1.0201 1.0090 0.9984 0.9991 1.0099 1.0007 1.0017 1.0194 1.0133 1.0126 1.0097 1.0107 1.0097 0.9841 0.9706
dispcorr: -0.021046519 hartree
energy: -1071.539764710489
dipole: -29.16136 30.13955 0.97819 10.60011 -9.86822 0.73189 8.28376 -7.52552 0.75824
magnitude: 1.43786 au
magnitude: 3.65475 debye
