program: Gaussian 09
title: 000072119
version: EM64L-G09RevD.01
frameworkgroup: C1[X(C17H19N5O)]
method: RPBEPBE
basis: SDD
operation: Freq
keyword: #p
keyword: freq=noraman
keyword: PBEPBE/SDD
title: #p freq=noraman PBEPBE/SDD
converged: YES YES NO NO
title: Mulliken charges:
elementType: O N N N N N C C C C C C C C C C C C C C C C C H H H H H H H H H H H H H H H H H H H
charge: -0.247115 -0.099363 -0.371334 -0.118126 -0.122618 -0.013686 -0.343968 -0.351502 -0.324723 -0.317263 -0.311793 -0.410228 0.082260 0.259380 0.060667 -0.339502 0.345498 -0.370022 -0.356476 -0.279106 -0.245734 -0.228510 -0.236136 0.222391 0.201304 0.194009 0.208728 0.226976 0.201831 0.216476 0.191629 0.191031 0.213790 0.235380 0.257996 0.331655 0.256980 0.213195 0.286156 0.228391 0.229777 0.231705
chargesum: 0.00000
title: Mulliken charges with hydrogens summed into heavy atoms:
elementType: O N N N N N C C C C C C C C C C C C C C C C C
charge: -0.247115 -0.099363 -0.039680 -0.118126 -0.122618 -0.013686 0.079727 0.051236 0.104083 0.090842 0.093029 0.083149 0.082260 0.259380 0.060667 -0.082522 0.345498 -0.156827 -0.070321 -0.279106 -0.017343 0.001266 -0.004431
polarizability: 3.39648909e+02 4.39592009e+01 2.70447949e+02 -1.86622736e+01 1.40313701e+01 1.25937673e+02
1716.lowfreq: -5.5061 -3.9584 -0.0006 -0.0005 0.0005 4.9249 15.3531 18.3397 19.7042
frequency: 14.9490 17.5370 19.5092 33.7162 53.2612 77.5993 90.9231 97.1298 117.1519 136.5252 173.9534 214.7822 228.5092 237.7475 261.6067 297.2274 321.4044 324.8112 366.0134 378.6466 396.7647 399.4236 403.5915 425.3245 455.8170 469.0571 474.9779 504.2351 516.1089 520.9259 601.1907 606.1531 615.7233 638.5843 645.5782 697.3831 699.5803 736.3111 757.2284 766.3709 781.5894 796.8791 812.5315 839.2427 852.3290 886.3204 896.3307 921.5881 933.5112 984.4065 988.5047 997.0512 1005.1273 1008.0535 1025.0662 1029.5502 1036.6205 1049.8028 1051.5454 1066.0836 1082.5527 1087.5107 1095.0369 1110.0877 1138.2283 1155.9848 1167.4021 1174.0162 1189.3226 1192.6501 1213.7519 1239.1489 1267.6839 1274.2780 1278.4701 1296.2836 1302.4969 1318.8413 1324.8441 1333.2777 1346.5868 1355.2812 1367.5486 1372.1533 1382.0334 1388.0886 1403.7444 1423.4743 1441.8948 1446.2181 1448.8806 1449.9978 1453.4271 1458.9641 1475.1360 1491.4079 1556.7621 1573.1113 1587.3702 1612.9771 2158.6370 2869.4338 2880.9631 2903.1411 2952.6966 2958.1050 3022.3932 3027.7193 3034.6855 3046.7997 3080.6103 3085.2207 3104.1425 3125.1574 3133.6044 3146.5123 3162.0334 3173.0865 3174.9418 3543.1777
redmass: 5.4983 3.0395 3.7336 7.1906 5.4183 4.5071 5.9128 7.3588 6.8906 3.3359 5.7896 3.0685 3.2255 1.9353 4.2040 5.5670 2.7506 4.5499 2.8329 5.5803 2.1894 3.5791 3.8586 5.9755 7.4163 2.8023 4.2880 1.5350 2.5480 4.8187 2.2410 7.2298 6.3429 4.0009 6.1615 1.8089 7.4063 2.6062 4.9751 3.4757 2.0528 2.1842 2.6376 1.6088 1.2685 8.0988 2.3390 1.5012 1.4656 1.3855 5.7988 2.8111 2.9383 1.5427 3.0378 2.4317 2.3173 2.7233 2.0080 3.5416 2.0755 2.5605 2.3822 2.6121 2.6294 4.8979 3.4010 1.0635 1.0655 1.1277 1.7811 1.7945 1.3435 1.3702 1.7847 1.2988 1.1977 1.3023 1.5184 1.2449 1.4455 2.4990 1.3587 1.3203 6.6901 1.3863 4.0849 1.7610 1.0833 1.1040 2.1837 1.0967 1.2012 1.1057 1.0923 2.4711 3.3321 6.7900 6.0294 6.0204 12.6224 1.0697 1.0700 1.0679 1.0666 1.0666 1.0917 1.0898 1.0607 1.0897 1.0963 1.0976 1.1052 1.0851 1.0881 1.0936 1.0976 1.0934 1.0975 1.0776
irintensity: 0.0702 0.2067 0.0265 0.1372 2.8091 0.8310 2.8130 0.5708 12.4564 1.1860 3.1429 11.9870 4.0612 0.9454 2.5157 4.5912 6.9911 2.9128 2.4015 0.8315 0.3118 2.2450 1.5789 6.1528 0.9595 1.1810 2.4374 87.6343 19.5165 9.6130 9.6461 26.6595 0.7966 7.1114 15.7326 47.7515 1.4329 2.2194 0.1548 5.5445 59.5504 8.8371 16.1251 0.4096 0.9500 0.9636 9.4179 17.3344 1.7608 0.4520 0.1801 23.0626 26.2464 4.4045 13.9604 9.7448 25.3877 26.2573 7.8894 13.0137 1.7726 32.5231 52.6725 9.6670 108.2693 95.2768 20.0054 0.9096 1.2025 6.7885 6.1870 16.2383 14.2510 14.5775 26.2315 3.9513 27.6505 20.0643 1.5544 4.4401 4.1863 7.3698 1.0424 4.8181 0.7857 11.1059 94.3473 79.0698 2.6782 6.8188 8.1360 24.3847 4.0232 15.4267 12.1639 14.2176 258.6222 165.3011 9.2969 0.9895 57.7142 71.0447 54.3167 92.5223 41.1138 104.4163 3.8182 62.0800 49.1932 32.2631 43.4569 30.0782 13.1146 6.4921 2.8960 31.9677 25.6753 2.8592 16.2268 73.2487
temp: 298.150 k
press: 1.00000 atm
elementType: 8 7 7 7 7 7 6 6 6 6 6 6 6 6 6 6 6 6 6 6 6 6 6 1 1 1 1 1 1 1 1 1 1 1 1 1 1 1 1 1 1 1
symmnumber: 1
zpe: 882936.5 jmol-1
zpe.correction: 0.336293 hartree
zpe.thermalcorrener: 0.356965 hartree
zpe.thermalcorrenthalpy: 0.357910 hartree
zpe.thermalcorrgfe: 0.282902 hartree
zpe.sumelectzpe: -1006.448741 hartree
zpe.sumelectthermal: -1006.428068 hartree
zpe.sumelectthermalent: -1006.427124 hartree
zpe.sumelectthermalfe: -1006.502131 hartree
dipole: -0.9562 0.9017 0.2966
dipole: 1.3473
quadrupole: -123.8410 -150.3579 -136.2151
quadrupole: 19.0871 -2.8164 2.7753
quadrupole: 12.9637 -13.5533 0.5896 19.0871 -2.8164 2.7753
hfenergy: -1006.7850337 hartree
pointgroup: C01 [X(C17H19N5O1)]
dipole: -0.3619867 0.3866027 -0.0220289 debye
polarizability: 341.5645779|30.3748733|257.4823171|-36.7546364|-39.0046465|136.9876361 unknown
InChI: InChI=1S/C17H19N5O/c18-13-15-12-16(14-4-2-1-3-5-14)20-21-17(15)19-6-7-22-8-10-23-11-9-22/h1-5,12,19H,6-11H2
charge 0 multiplicity 1
42 atoms
O  6.097119 -2.231333 0.914972
N  4.323985 -0.144771 -0.048774
N  1.337172 1.759528 -1.425982
N  0.042532 -0.049791 -0.659442
N  -1.137556 -0.590354 -0.267309
N  -0.830366 4.624428 -1.788953
C  3.836305 -1.535754 0.161155
C  5.424892 0.160355 0.900906
C  3.232677 0.852655 -0.040568
C  4.996536 -2.526478 -0.019796
C  6.567289 -0.851952 0.708099
C  2.552844 0.924378 -1.433028
C  0.111441 1.287161 -1.033907
C  -1.069852 2.120304 -1.024994
C  -2.296548 0.166933 -0.224116
C  -2.278419 1.533931 -0.611664
C  -3.522611 -0.539377 0.233957
C  -4.719286 0.162819 0.545998
C  -3.509477 -1.955328 0.37185
C  -0.976568 3.488488 -1.437068
C  -5.870891 -0.530978 0.974252
C  -4.660431 -2.645785 0.800898
C  -5.848846 -1.93879 1.102303
H  3.034149 -1.763951 -0.5636
H  3.40565 -1.656472 1.186132
H  5.078994 0.118405 1.964161
H  5.802212 1.181427 0.701844
H  2.453237 0.62088 0.72341
H  3.657472 1.843475 0.209591
H  4.681191 -3.556606 0.213952
H  5.370067 -2.476106 -1.065366
H  6.982964 -0.747259 -0.317612
H  7.366874 -0.697855 1.451606
H  3.260997 1.337579 -2.171441
H  2.268748 -0.090436 -1.754255
H  1.41531 2.746378 -1.679627
H  -3.189719 2.136144 -0.612068
H  -4.762646 1.25553 0.47527
H  -2.583956 -2.489464 0.139573
H  -6.782621 0.027627 1.213102
H  -4.632697 -3.736686 0.898741
H  -6.74377 -2.476299 1.434599
