program: Orca
programVersion: 5.0.2
elementType: O O O O N N C C C C C C C C C C C C C C C C C H H H H H H H H H H H H H H H H H H H H H H
charge: 0
multiplicity: 1
keywords: wb97x-d3
keywords: def2-TZVPP
keywords: def2/J RIJCOSX
keywords: DEFGRID2
keywords: scfconv7
keywords: smallprint printgap noloewdin
keywords: NOSOSCF
formula: C17H22N2O4
InChI: InChI=1/C17H22N2O4/c1-6-7-18-9-13(20)19(16(18)22)10-23-15(21)14-12(8-11(2)3)17(14,4)5/h1,8,12,14H,7,9-10H2,2-5H3
45 atoms
O  0.234613 0.99261 0.531867
O  -0.878153 0.48524 2.411454
O  3.379079 2.519754 -0.491503
O  2.025712 -1.612808 0.875223
N  2.498482 0.611869 0.45112
N  3.714852 -0.9443 -0.545703
C  -2.465886 -1.215799 0.234733
C  -3.301981 -0.129892 0.825507
C  -1.931898 0.207507 0.28208
C  -2.792111 -1.737326 -1.144045
C  -1.885637 -2.268392 1.148521
C  -4.525971 0.390278 0.167126
C  -0.843505 0.562837 1.213417
C  -5.082858 1.5751 0.422015
C  -6.348515 2.003936 -0.256095
C  -4.509604 2.560119 1.394721
C  1.445129 1.166475 1.240824
C  3.330974 1.327982 -0.376766
C  2.67308 -0.770334 0.314216
C  4.177399 0.298266 -1.099516
C  4.072858 -2.230127 -1.082057
C  3.673907 -2.383509 -2.479588
C  3.356806 -2.480583 -3.632223
H  -3.336581 -0.141702 1.911673
H  -1.891621 0.713071 -0.676194
H  -3.149895 -0.956974 -1.815707
H  -1.906515 -2.18298 -1.599646
H  -3.561421 -2.510778 -1.092616
H  -2.563973 -3.121914 1.202549
H  -0.92491 -2.626546 0.774627
H  -1.7315 -1.906855 2.162614
H  -5.015376 -0.262423 -0.549668
H  -6.709901 1.255535 -0.96048
H  -7.141773 2.188268 0.472794
H  -6.204995 2.939508 -0.802438
H  -5.220017 2.767284 2.19909
H  -3.580517 2.221939 1.849092
H  -4.312541 3.516491 0.90393
H  1.647159 2.228178 1.378165
H  1.406554 0.671713 2.209789
H  4.006598 0.364982 -2.178844
H  5.240016 0.47633 -0.913122
H  3.594399 -2.994333 -0.468159
H  5.152354 -2.38123 -0.993389
H  3.066474 -2.578824 -4.650681
totalener: -1071.51876206 hartree
nucrepener: 1935.74084836 hartree
electener: -3007.25961041 hartree
oneelecener: -5303.60346253 hartree
twoeener: 2296.34385212 hartree
kineticenergy: 1066.93899646 hartree
xcener: -102.626508087834 hartree
chargesum: 0.0000000
charge: -0.268592 -0.377955 -0.341992 -0.386429 -0.138070 -0.166534 0.131724 -0.044782 -0.070039 -0.285649 -0.242751 -0.222057 0.331474 -0.005099 -0.212110 -0.231177 0.060844 0.236485 0.350971 -0.029524 -0.086688 -0.399612 0.103511 0.103381 0.080679 0.079129 0.093997 0.093472 0.082761 0.094134 0.094817 0.093782 0.077028 0.086072 0.084177 0.088617 0.081578 0.083909 0.117783 0.140883 0.110563 0.103513 0.131549 0.123306 0.248922
qa: -0.2686 -0.3780 -0.3420 -0.3864 -0.1381 -0.1665 0.1317 -0.0448 -0.0700 -0.2856 -0.2428 -0.2221 0.3315 -0.0051 -0.2121 -0.2312 0.0608 0.2365 0.3510 -0.0295 -0.0867 -0.3996 0.1035 0.1034 0.0807 0.0791 0.0940 0.0935 0.0828 0.0941 0.0948 0.0938 0.0770 0.0861 0.0842 0.0886 0.0816 0.0839 0.1178 0.1409 0.1106 0.1035 0.1315 0.1233 0.2489
va: 2.1073 2.1187 2.1773 2.1282 3.1085 3.1338 3.7902 3.8496 3.8156 3.9121 3.8902 3.8967 4.1973 3.7319 3.9413 3.9454 3.9019 4.2555 4.3207 3.8944 3.9154 3.7816 3.6353 1.0249 1.0328 1.0044 1.0063 1.0001 1.0014 1.0097 1.0199 1.0088 1.0103 0.9982 0.9989 1.0007 1.0212 1.0005 1.0102 1.0130 1.0110 1.0080 1.0100 0.9840 0.9705
dispcorr: -0.021060787 hartree
energy: -1071.539822842806
dipole: -30.86678 31.51115 0.64437 -1.73074 1.19754 -0.53320 -2.54695 1.38154 -1.16541
magnitude: 1.43447 au
magnitude: 3.64613 debye
