program: Orca
programVersion: 5.0.2
elementType: O O O O N N C C C C C C C C C C C C C C C C C H H H H H H H H H H H H H H H H H H H H H H
charge: 0
multiplicity: 1
keywords: wb97x-d3
keywords: def2-TZVPP
keywords: def2/J RIJCOSX
keywords: DEFGRID2
keywords: scfconv7
keywords: smallprint printgap noloewdin
keywords: NOSOSCF
formula: C17H22N2O4
InChI: InChI=1/C17H22N2O4/c1-6-7-18-9-13(20)19(16(18)22)10-23-15(21)14-12(8-11(2)3)17(14,4)5/h1,8,12,14H,7,9-10H2,2-5H3
45 atoms
O  0.256188 1.063676 0.452281
O  -0.855632 0.646312 2.355093
O  3.472454 2.492976 -0.611222
O  1.968841 -1.522316 0.93416
N  2.517327 0.66162 0.407855
N  3.695262 -0.979162 -0.496321
C  -2.42407 -1.196701 0.287804
C  -3.269538 -0.078012 0.799167
C  -1.896217 0.228849 0.242256
C  -2.73584 -1.814188 -1.05446
C  -1.847784 -2.184076 1.274283
C  -4.491686 0.394302 0.104013
C  -0.81749 0.6544 1.154867
C  -5.106636 1.553117 0.34616
C  -6.36803 1.930752 -0.369387
C  -4.605204 2.559074 1.337177
C  1.465255 1.282577 1.149933
C  3.383393 1.310236 -0.440792
C  2.650023 -0.729973 0.34095
C  4.20423 0.220395 -1.102163
C  4.008046 -2.29909 -0.975994
C  3.624892 -2.489691 -2.373438
C  3.323655 -2.618032 -3.527264
H  -3.30868 -0.018406 1.883277
H  -1.852156 0.669705 -0.747276
H  -1.845952 -2.29335 -1.465497
H  -3.508403 -2.579956 -0.957805
H  -3.081303 -1.083367 -1.785546
H  -1.699527 -1.754789 2.262421
H  -2.526172 -3.032496 1.381393
H  -0.88484 -2.564722 0.930095
H  -4.929196 -0.272184 -0.63325
H  -6.67751 1.168628 -1.083745
H  -7.189602 2.082242 0.335387
H  -6.246442 2.871785 -0.911738
H  -3.661965 2.272999 1.798171
H  -4.459526 3.530487 0.858171
H  -5.335751 2.715432 2.13514
H  1.675757 2.350034 1.205067
H  1.419166 0.864644 2.15414
H  4.047551 0.241045 -2.185517
H  5.269875 0.373318 -0.911082
H  3.488211 -3.018048 -0.341482
H  5.078663 -2.491492 -0.863007
H  3.047799 -2.742955 -4.546849
totalener: -1071.51870812 hartree
nucrepener: 1937.25096487 hartree
electener: -3008.76967300 hartree
oneelecener: -5306.63895310 hartree
twoeener: 2297.86928010 hartree
kineticenergy: 1066.93638411 hartree
xcener: -102.626294293742 hartree
chargesum: -0.0000000
charge: -0.270388 -0.378346 -0.342289 -0.387797 -0.137621 -0.166409 0.131475 -0.049189 -0.058366 -0.286080 -0.242149 -0.214791 0.330317 -0.007274 -0.213268 -0.234328 0.059282 0.236965 0.352385 -0.029633 -0.085052 -0.400705 0.103373 0.101692 0.079541 0.094578 0.094685 0.076424 0.094425 0.083226 0.093632 0.093544 0.076908 0.085961 0.084210 0.082261 0.083086 0.088679 0.117561 0.141636 0.110561 0.103700 0.131357 0.123196 0.249027
qa: -0.2704 -0.3783 -0.3423 -0.3878 -0.1376 -0.1664 0.1315 -0.0492 -0.0584 -0.2861 -0.2421 -0.2148 0.3303 -0.0073 -0.2133 -0.2343 0.0593 0.2370 0.3524 -0.0296 -0.0851 -0.4007 0.1034 0.1017 0.0795 0.0946 0.0947 0.0764 0.0944 0.0832 0.0936 0.0935 0.0769 0.0860 0.0842 0.0823 0.0831 0.0887 0.1176 0.1416 0.1106 0.1037 0.1314 0.1232 0.2490
va: 2.1057 2.1184 2.1773 2.1268 3.1075 3.1330 3.8002 3.8531 3.8145 3.9128 3.8877 3.8989 4.1987 3.7355 3.9416 3.9469 3.9016 4.2553 4.3186 3.8942 3.9154 3.7833 3.6358 1.0241 1.0331 1.0061 0.9999 1.0048 1.0202 1.0013 1.0109 1.0093 1.0104 0.9979 0.9987 1.0207 1.0004 1.0001 1.0114 1.0130 1.0113 1.0080 1.0102 0.9841 0.9704
dispcorr: -0.021072218 hartree
energy: -1071.539780343097
dipole: -31.02829 31.66149 0.63320 -2.26901 1.63521 -0.63380 -2.23812 1.11180 -1.12631
magnitude: 1.43918 au
magnitude: 3.65809 debye
