program: Orca
programVersion: 5.0.2
elementType: O O O O N N C C C C C C C C C C C C C C C C C H H H H H H H H H H H H H H H H H H H H H H
charge: 0
multiplicity: 1
keywords: wb97x-d3
keywords: def2-TZVPP
keywords: def2/J RIJCOSX
keywords: DEFGRID2
keywords: scfconv7
keywords: smallprint printgap noloewdin
keywords: NOSOSCF
formula: C17H22N2O4
InChI: InChI=1/C17H22N2O4/c1-6-7-18-9-13(20)19(16(18)22)10-23-15(21)14-12(8-11(2)3)17(14,4)5/h1,8,12,14H,7,9-10H2,2-5H3
45 atoms
O  0.124458 0.148952 0.924819
O  -1.163784 -1.520575 1.678365
O  3.505032 1.360626 1.549178
O  1.563911 -1.549177 -1.374749
N  2.318056 -0.20959 0.3538
N  3.322905 -0.076147 -1.612964
C  -2.855774 -0.3386 -0.770509
C  -3.562411 -0.210684 0.539199
C  -2.135999 0.269486 0.422701
C  -3.184969 0.62072 -1.888874
C  -2.466641 -1.713269 -1.258824
C  -4.669874 0.753485 0.759374
C  -1.051228 -0.481567 1.085971
C  -5.029069 1.240164 1.947988
C  -6.188996 2.17787 2.091546
C  -4.32313 0.892343 3.222667
C  1.299859 -0.548041 1.294873
C  3.298982 0.734138 0.548966
C  2.319835 -0.716944 -0.951392
C  4.069763 0.800573 -0.754216
C  3.772486 -0.469239 -2.921725
C  5.086364 -1.108352 -2.892325
C  6.17589 -1.607483 -2.846591
H  -3.655116 -1.145928 1.085301
H  -1.97572 1.340425 0.364508
H  -2.341002 0.706145 -2.575076
H  -4.042098 0.264391 -2.463963
H  -3.420204 1.622294 -1.529054
H  -2.309578 -2.419702 -0.446657
H  -3.256995 -2.115638 -1.895072
H  -1.548625 -1.674999 -1.847983
H  -5.244587 1.050646 -0.112706
H  -5.877698 3.122413 2.544347
H  -6.655164 2.40247 1.133034
H  -6.955874 1.757689 2.746875
H  -5.00697 0.403125 3.920865
H  -3.471327 0.23189 3.07363
H  -3.964282 1.794395 3.724333
H  1.631878 -0.234981 2.284414
H  1.133969 -1.624132 1.288868
H  4.103825 1.828651 -1.124375
H  5.099508 0.460725 -0.601787
H  3.810518 0.403864 -3.579622
H  3.030664 -1.15043 -3.340626
H  7.132866 -2.069898 -2.807459
totalener: -1071.51862456 hartree
nucrepener: 1919.92999509 hartree
electener: -2991.44861965 hartree
oneelecener: -5271.87880106 hartree
twoeener: 2280.43018141 hartree
kineticenergy: 1066.94367004 hartree
xcener: -102.627146155950 hartree
chargesum: 0.0000000
charge: -0.266026 -0.376209 -0.341298 -0.387682 -0.138026 -0.164102 0.132012 -0.035443 -0.078522 -0.284711 -0.244050 -0.228973 0.326973 -0.006051 -0.211348 -0.228969 0.066609 0.234343 0.349387 -0.030377 -0.081410 -0.401053 0.101239 0.103616 0.081892 0.092733 0.093346 0.080774 0.093318 0.083190 0.095087 0.093786 0.084312 0.077710 0.086266 0.088989 0.081826 0.083294 0.119159 0.137655 0.104118 0.109733 0.124040 0.129987 0.248855
qa: -0.2660 -0.3762 -0.3413 -0.3877 -0.1380 -0.1641 0.1320 -0.0354 -0.0785 -0.2847 -0.2440 -0.2290 0.3270 -0.0061 -0.2113 -0.2290 0.0666 0.2343 0.3494 -0.0304 -0.0814 -0.4011 0.1012 0.1036 0.0819 0.0927 0.0933 0.0808 0.0933 0.0832 0.0951 0.0938 0.0843 0.0777 0.0863 0.0890 0.0818 0.0833 0.1192 0.1377 0.1041 0.1097 0.1240 0.1300 0.2489
va: 2.1079 2.1172 2.1768 2.1265 3.1132 3.1337 3.7825 3.8447 3.8219 3.9093 3.8922 3.8995 4.2025 3.7321 3.9411 3.9441 3.9055 4.2557 4.3182 3.8953 3.9150 3.7793 3.6371 1.0257 1.0319 1.0062 1.0004 1.0044 1.0196 1.0018 1.0089 1.0088 0.9991 1.0099 0.9984 1.0011 1.0218 1.0008 1.0092 1.0104 1.0100 1.0089 0.9836 1.0116 0.9706
dispcorr: -0.020960588 hartree
energy: -1071.539585147974
dipole: -31.34183 31.99311 0.65128 5.95162 -5.26414 0.68748 0.00526 -1.11441 -1.10914
magnitude: 1.45842 au
magnitude: 3.70702 debye
