program: Orca
programVersion: 5.0.2
elementType: O O O O N N C C C C C C C C C C C C C C C C C H H H H H H H H H H H H H H H H H H H H H H
charge: 0
multiplicity: 1
keywords: wb97x-d3
keywords: def2-TZVPP
keywords: def2/J RIJCOSX
keywords: DEFGRID2
keywords: scfconv7
keywords: smallprint printgap noloewdin
keywords: NOSOSCF
formula: C17H22N2O4
InChI: InChI=1/C17H22N2O4/c1-6-7-18-9-13(20)19(16(18)22)10-23-15(21)14-12(8-11(2)3)17(14,4)5/h1,8,12,14H,7,9-10H2,2-5H3
45 atoms
O  0.316857 0.819961 0.071899
O  -0.828095 2.189889 -1.275156
O  1.550213 -1.315129 -2.231966
O  3.576057 0.64208 1.353789
N  2.367861 -0.037038 -0.50207
N  3.797536 -1.452125 0.417482
C  -3.181169 1.785551 0.714271
C  -3.291174 0.713192 -0.323258
C  -1.976832 0.916231 0.398051
C  -3.816764 1.543286 2.062239
C  -3.239952 3.230531 0.28302
C  -4.052878 -0.542977 -0.100664
C  -0.810951 1.4009 -0.368513
C  -5.371249 -0.66866 -0.254318
C  -6.064079 -1.978699 -0.033388
C  -6.260284 0.465587 -0.663478
C  1.515824 1.097753 -0.633234
C  2.275304 -1.160651 -1.291316
C  3.29606 -0.191783 0.536078
C  3.284099 -2.142799 -0.73219
C  4.913353 -1.926299 1.191615
C  6.113065 -2.117233 0.379686
C  7.079515 -2.298142 -0.307197
H  -3.284295 1.080264 -1.346708
H  -1.735427 0.177088 1.154299
H  -4.87936 1.792087 2.030966
H  -3.736537 0.505571 2.382905
H  -3.350004 2.169762 2.824193
H  -4.277501 3.570818 0.304331
H  -2.674296 3.866816 0.96606
H  -2.854376 3.392269 -0.71952
H  -3.480323 -1.418587 0.191609
H  -6.572025 -2.313212 -0.941285
H  -5.371468 -2.762826 0.269879
H  -6.832739 -1.890984 0.738544
H  -6.752743 0.247223 -1.61446
H  -7.056928 0.617571 0.068997
H  -5.724376 1.406351 -0.774246
H  1.318076 1.280392 -1.688414
H  2.014351 1.963878 -0.199029
H  2.794795 -3.086538 -0.475754
H  4.059069 -2.35432 -1.475906
H  4.654185 -2.870303 1.680099
H  5.103942 -1.200773 1.983365
H  7.945228 -2.443257 -0.907852
totalener: -1071.51906130 hartree
nucrepener: 1884.03138332 hartree
electener: -2955.55044462 hartree
oneelecener: -5200.01407300 hartree
twoeener: 2244.46362838 hartree
kineticenergy: 1066.93848997 hartree
xcener: -102.625931899601 hartree
chargesum: -0.0000000
charge: -0.268735 -0.388643 -0.336452 -0.381716 -0.145635 -0.169590 0.084039 -0.038563 -0.100798 -0.241728 -0.266502 -0.176698 0.358700 -0.030055 -0.209924 -0.238651 0.081542 0.231256 0.340383 -0.024441 -0.085446 -0.400324 0.102602 0.111816 0.077608 0.085028 0.082037 0.096440 0.079418 0.088705 0.107516 0.089087 0.087224 0.078741 0.083531 0.098103 0.085954 0.082015 0.130391 0.124261 0.103579 0.110403 0.124058 0.130811 0.248652
qa: -0.2687 -0.3886 -0.3365 -0.3817 -0.1456 -0.1696 0.0840 -0.0386 -0.1008 -0.2417 -0.2665 -0.1767 0.3587 -0.0301 -0.2099 -0.2387 0.0815 0.2313 0.3404 -0.0244 -0.0854 -0.4003 0.1026 0.1118 0.0776 0.0850 0.0820 0.0964 0.0794 0.0887 0.1075 0.0891 0.0872 0.0787 0.0835 0.0981 0.0860 0.0820 0.1304 0.1243 0.1036 0.1104 0.1241 0.1308 0.2487
va: 2.1121 2.1091 2.1786 2.1440 3.1293 3.1360 3.7084 3.8331 3.9050 3.9075 3.9017 3.8505 4.1934 3.7396 3.9384 3.9362 3.8969 4.2560 4.3420 3.8887 3.9145 3.7761 3.6350 1.0220 1.0348 1.0027 1.0070 1.0059 1.0011 1.0036 1.0225 1.0127 0.9981 1.0107 0.9991 1.0026 0.9996 1.0111 1.0100 1.0045 1.0097 1.0097 0.9835 1.0113 0.9706
dispcorr: -0.020420681 hartree
energy: -1071.539481982039
dipole: -38.33585 38.50056 0.16470 1.92457 -3.15921 -1.23464 5.42704 -4.83970 0.58734
magnitude: 1.37711 au
magnitude: 3.50033 debye
