program: Orca
programVersion: 5.0.2
elementType: O O O O N N C C C C C C C C C C C C C C C C C H H H H H H H H H H H H H H H H H H H H H H
charge: 0
multiplicity: 1
keywords: wb97x-d3
keywords: def2-TZVPP
keywords: def2/J RIJCOSX
keywords: DEFGRID2
keywords: scfconv7
keywords: smallprint printgap noloewdin
keywords: NOSOSCF
formula: C17H22N2O4
InChI: InChI=1/C17H22N2O4/c1-6-7-18-9-13(20)19(16(18)22)10-23-15(21)14-12(8-11(2)3)17(14,4)5/h1,8,12,14H,7,9-10H2,2-5H3
45 atoms
O  0.329061 1.363387 1.398879
O  -0.217552 -0.709838 0.751285
O  2.118772 2.302692 -0.935219
O  2.844252 -1.632444 1.255035
N  2.320155 0.481331 0.455468
N  3.112523 -1.031312 -0.950869
C  -2.480675 1.004755 -0.676137
C  -3.03875 0.14334 0.419326
C  -1.856712 1.034052 0.708132
C  -3.224627 2.249477 -1.095018
C  -1.758342 0.336187 -1.820185
C  -4.336357 0.421484 1.067362
C  -0.528322 0.433991 0.947773
C  -5.373492 -0.413885 1.153267
C  -6.631746 -0.008373 1.861351
C  -5.400338 -1.796244 0.575059
C  1.672575 0.989815 1.626261
C  2.425689 1.161236 -0.732352
C  2.765257 -0.847048 0.352002
C  2.994737 0.169405 -1.727961
C  3.78321 -2.214898 -1.415027
C  5.184361 -1.973554 -1.753488
C  6.327153 -1.756052 -2.046131
H  -2.774412 -0.904886 0.330845
H  -2.045454 1.941611 1.271796
H  -3.703025 2.758871 -0.259832
H  -2.543944 2.959377 -1.56773
H  -4.005027 2.001439 -1.816471
H  -1.286848 -0.601251 -1.533293
H  -2.465005 0.118296 -2.622963
H  -0.98803 0.994381 -2.229133
H  -4.444944 1.402144 1.521809
H  -7.492925 -0.050391 1.189707
H  -6.85073 -0.686304 2.690113
H  -6.569746 1.001867 2.264131
H  -5.593555 -2.538272 1.353461
H  -6.212123 -1.889952 -0.150555
H  -4.478794 -2.076497 0.070291
H  2.158181 1.905333 1.956402
H  1.755502 0.22745 2.401808
H  2.314168 0.058968 -2.577318
H  3.95929 0.519491 -2.108919
H  3.263203 -2.617796 -2.289056
H  3.711921 -2.968567 -0.629652
H  7.344108 -1.576338 -2.29971
totalener: -1071.51701370 hartree
nucrepener: 1951.88760974 hartree
electener: -3023.40462345 hartree
oneelecener: -5335.89855085 hartree
twoeener: 2312.49392740 hartree
kineticenergy: 1066.94219558 hartree
xcener: -102.629013958331 hartree
chargesum: -0.0000000
charge: -0.256398 -0.379040 -0.336724 -0.375740 -0.151725 -0.153981 0.114210 0.038226 -0.108923 -0.242270 -0.283214 -0.193930 0.341045 -0.043996 -0.206276 -0.235465 0.080160 0.207006 0.354515 -0.023829 -0.091161 -0.400471 0.104258 0.091649 0.072324 0.070752 0.098155 0.089861 0.094857 0.090573 0.089421 0.074741 0.083534 0.085694 0.076603 0.087515 0.084659 0.082498 0.124659 0.133009 0.099695 0.110720 0.124163 0.130926 0.247714
qa: -0.2564 -0.3790 -0.3367 -0.3757 -0.1517 -0.1540 0.1142 0.0382 -0.1089 -0.2423 -0.2832 -0.1939 0.3410 -0.0440 -0.2063 -0.2355 0.0802 0.2070 0.3545 -0.0238 -0.0912 -0.4005 0.1043 0.0916 0.0723 0.0708 0.0982 0.0899 0.0949 0.0906 0.0894 0.0747 0.0835 0.0857 0.0766 0.0875 0.0847 0.0825 0.1247 0.1330 0.0997 0.1107 0.1242 0.1309 0.2477
va: 2.1301 2.1237 2.1790 2.1533 3.0995 3.1273 3.7343 3.7809 3.8963 3.9095 3.9095 3.8991 4.2444 3.8132 3.9372 3.9469 3.9184 4.2739 4.3301 3.9030 3.9224 3.7856 3.6277 1.0340 1.0388 1.0108 1.0034 1.0045 1.0182 1.0045 1.0047 1.0200 0.9984 0.9979 1.0123 0.9992 0.9993 1.0147 0.9922 1.0154 1.0075 1.0107 0.9836 1.0110 0.9712
dispcorr: -0.021636728 hartree
energy: -1071.538650432248
dipole: -34.96346 34.75851 -0.20495 -0.04528 0.06931 0.02403 -4.48148 3.65964 -0.82184
magnitude: 0.84735 au
magnitude: 2.15380 debye
