program: Orca
programVersion: 5.0.2
elementType: O O O O N N C C C C C C C C C C C C C C C C C H H H H H H H H H H H H H H H H H H H H H H
charge: 0
multiplicity: 1
keywords: wb97x-d3
keywords: def2-TZVPP
keywords: def2/J RIJCOSX
keywords: DEFGRID2
keywords: scfconv7
keywords: smallprint printgap noloewdin
keywords: NOSOSCF
formula: C17H22N2O4
InChI: InChI=1/C17H22N2O4/c1-6-7-18-9-13(20)19(16(18)22)10-23-15(21)14-12(8-11(2)3)17(14,4)5/h1,8,12,14H,7,9-10H2,2-5H3
45 atoms
O  0.1495 0.682915 -0.248537
O  -1.313761 1.41497 -1.765183
O  3.382799 1.980885 0.064627
O  1.775486 -2.150649 -1.002829
N  2.314331 0.074899 -0.661726
N  3.605659 -1.48502 0.230664
C  -3.059298 2.057525 0.764731
C  -3.501402 0.759751 0.163774
C  -2.03177 0.978829 0.479487
C  -3.330762 2.337788 2.22406
C  -3.126933 3.300546 -0.088739
C  -4.253518 -0.263353 0.910468
C  -1.07283 1.06569 -0.639151
C  -5.241943 -1.032012 0.447344
C  -5.897294 -2.04777 1.335342
C  -5.788114 -0.981893 -0.947162
C  1.15228 0.647108 -1.252281
C  3.300759 0.788899 -0.020845
C  2.489076 -1.309297 -0.529615
C  4.262013 -0.243452 0.533398
C  4.223992 -2.770179 0.41445
C  5.446802 -2.923016 -0.371341
C  6.457325 -3.021675 -1.009752
H  -3.720122 0.824896 -0.896101
H  -1.647975 0.466814 1.354791
H  -3.198659 1.464139 2.860706
H  -2.656395 3.112539 2.592395
H  -4.35362 2.692956 2.36042
H  -4.100639 3.776735 0.040285
H  -2.3655 4.022343 0.21317
H  -2.993037 3.096865 -1.147826
H  -3.955809 -0.410698 1.944257
H  -6.971924 -1.866365 1.41734
H  -5.782342 -3.055649 0.928242
H  -5.479453 -2.044897 2.341395
H  -6.855408 -0.747952 -0.932863
H  -5.300888 -0.247928 -1.584322
H  -5.690999 -1.955747 -1.433162
H  0.835774 0.034298 -2.095748
H  1.391216 1.65119 -1.602532
H  5.236768 -0.153708 0.042188
H  4.40812 -0.091136 1.60601
H  3.49864 -3.534764 0.133278
H  4.45152 -2.922295 1.47333
H  7.347539 -3.121337 -1.583363
totalener: -1071.52104430 hartree
nucrepener: 1880.40563782 hartree
electener: -2951.92668212 hartree
oneelecener: -5192.70802207 hartree
twoeener: 2240.78133995 hartree
kineticenergy: 1066.94408296 hartree
xcener: -102.627710906284 hartree
chargesum: 0.0000000
charge: -0.263707 -0.389519 -0.338997 -0.376919 -0.153398 -0.169660 0.081657 0.040809 -0.074431 -0.249140 -0.254118 -0.179807 0.337612 -0.053616 -0.201836 -0.237056 0.091022 0.233043 0.343221 -0.028029 -0.087079 -0.398570 0.103016 0.090283 0.068023 0.071300 0.091725 0.093621 0.084541 0.085535 0.100869 0.069051 0.082853 0.085732 0.074882 0.085223 0.084626 0.086814 0.127511 0.126576 0.110019 0.103097 0.130943 0.123785 0.248494
qa: -0.2637 -0.3895 -0.3390 -0.3769 -0.1534 -0.1697 0.0817 0.0408 -0.0744 -0.2491 -0.2541 -0.1798 0.3376 -0.0536 -0.2018 -0.2371 0.0910 0.2330 0.3432 -0.0280 -0.0871 -0.3986 0.1030 0.0903 0.0680 0.0713 0.0917 0.0936 0.0845 0.0855 0.1009 0.0691 0.0829 0.0857 0.0749 0.0852 0.0846 0.0868 0.1275 0.1266 0.1100 0.1031 0.1309 0.1238 0.2485
va: 2.1154 2.1121 2.1782 2.1487 3.1388 3.1292 3.7382 3.7925 3.8754 3.9190 3.9113 3.9077 4.2157 3.8333 3.9339 3.9450 3.9028 4.2532 4.3389 3.8906 3.9195 3.7725 3.6374 1.0324 1.0368 1.0108 1.0042 1.0034 1.0006 1.0029 1.0215 1.0224 0.9983 0.9981 1.0126 0.9988 1.0162 0.9990 1.0032 1.0027 1.0087 1.0107 1.0096 0.9839 0.9707
dispcorr: -0.019326302 hartree
energy: -1071.540370605312
dipole: -34.74266 35.34367 0.60102 2.23863 -2.89903 -0.66040 8.54134 -7.52903 1.01232
magnitude: 1.34986 au
magnitude: 3.43108 debye
