program: Orca
programVersion: 5.0.2
elementType: O O O O N N C C C C C C C C C C C C C C C C C H H H H H H H H H H H H H H H H H H H H H H
charge: 0
multiplicity: 1
keywords: wb97x-d3
keywords: def2-TZVPP
keywords: def2/J RIJCOSX
keywords: DEFGRID2
keywords: scfconv7
keywords: smallprint printgap noloewdin
keywords: NOSOSCF
formula: C17H22N2O4
InChI: InChI=1/C17H22N2O4/c1-6-7-18-9-13(20)19(16(18)22)10-23-15(21)14-12(8-11(2)3)17(14,4)5/h1,8,12,14H,7,9-10H2,2-5H3
45 atoms
O  0.154552 0.640466 0.064231
O  -0.939413 2.58378 0.115525
O  2.122832 -0.169317 -2.560613
O  3.110237 0.372387 1.856817
N  2.391869 0.387024 -0.344588
N  4.0216 -0.9898 0.23639
C  -3.077031 0.789038 1.607833
C  -3.517407 1.114891 0.222427
C  -2.134125 0.533311 0.442519
C  -3.618434 -0.449822 2.280519
C  -2.809271 1.917667 2.573111
C  -4.55728 0.334482 -0.494468
C  -0.952522 1.382539 0.198307
C  -4.662064 0.243916 -1.821111
C  -5.769424 -0.532393 -2.466335
C  -3.705871 0.90194 -2.768148
C  1.352064 1.349721 -0.211151
C  2.655316 -0.315292 -1.497846
C  3.176071 -0.045826 0.733083
C  3.756601 -1.293996 -1.142299
C  4.882208 -1.783365 1.072271
C  4.440953 -3.173236 1.162715
C  4.076806 -4.314764 1.208326
H  -3.496409 2.176538 -0.010648
H  -1.999308 -0.510235 0.182285
H  -4.578192 -0.240417 2.757433
H  -3.766655 -1.275045 1.584132
H  -2.932525 -0.792682 3.05671
H  -2.065606 1.62624 3.317262
H  -2.456265 2.820915 2.081368
H  -3.727917 2.168291 3.106694
H  -5.301014 -0.17013 0.115353
H  -6.387909 0.114262 -3.093835
H  -5.372646 -1.312745 -3.120646
H  -6.419603 -1.007517 -1.732623
H  -2.920643 1.461798 -2.264733
H  -3.226597 0.160027 -3.411747
H  -4.233772 1.591294 -3.431993
H  1.263216 1.913139 -1.140121
H  1.600252 2.030094 0.602804
H  3.407032 -2.321483 -1.285198
H  4.627948 -1.14051 -1.785116
H  4.898656 -1.328288 2.063528
H  5.906803 -1.750725 0.690355
H  3.751967 -5.325924 1.265364
totalener: -1071.52027368 hartree
nucrepener: 1906.67255715 hartree
electener: -2978.19283082 hartree
oneelecener: -5245.32528941 hartree
twoeener: 2267.13245859 hartree
kineticenergy: 1066.94217576 hartree
xcener: -102.626671035815 hartree
chargesum: 0.0000000
charge: -0.258981 -0.388475 -0.337869 -0.380439 -0.152902 -0.170355 0.132744 -0.040560 -0.072061 -0.280322 -0.255250 -0.228681 0.319207 -0.002397 -0.211676 -0.226996 0.087763 0.234130 0.343352 -0.026080 -0.085591 -0.400198 0.104360 0.104394 0.080160 0.092902 0.082032 0.093577 0.089860 0.100458 0.084330 0.093943 0.086246 0.084705 0.078111 0.080650 0.088147 0.088314 0.124834 0.128070 0.110236 0.103603 0.130717 0.123665 0.248323
qa: -0.2590 -0.3885 -0.3379 -0.3804 -0.1529 -0.1704 0.1327 -0.0406 -0.0721 -0.2803 -0.2553 -0.2287 0.3192 -0.0024 -0.2117 -0.2270 0.0878 0.2341 0.3434 -0.0261 -0.0856 -0.4002 0.1044 0.1044 0.0802 0.0929 0.0820 0.0936 0.0899 0.1005 0.0843 0.0939 0.0862 0.0847 0.0781 0.0806 0.0881 0.0883 0.1248 0.1281 0.1102 0.1036 0.1307 0.1237 0.2483
va: 2.1149 2.1074 2.1805 2.1455 3.1330 3.1348 3.7532 3.8424 3.8257 3.9148 3.8949 3.8932 4.2001 3.7332 3.9411 3.9464 3.9043 4.2568 4.3378 3.8876 3.9098 3.7808 3.6349 1.0260 1.0326 1.0001 1.0046 1.0064 1.0019 1.0191 1.0020 1.0090 0.9985 0.9991 1.0097 1.0195 1.0009 1.0008 1.0006 1.0054 1.0112 1.0084 1.0114 0.9833 0.9708
dispcorr: -0.020181058 hartree
energy: -1071.540454733556
dipole: -31.36725 31.93593 0.56868 -1.33111 -0.00217 -1.33328 -0.61924 0.52974 -0.08950
magnitude: 1.45226 au
magnitude: 3.69134 debye
