program: Orca
programVersion: 5.0.2
elementType: O O O O N N C C C C C C C C C C C C C C C C C H H H H H H H H H H H H H H H H H H H H H H
charge: 0
multiplicity: 1
keywords: wb97x-d3
keywords: def2-TZVPP
keywords: def2/J RIJCOSX
keywords: DEFGRID2
keywords: scfconv7
keywords: smallprint printgap noloewdin
keywords: NOSOSCF
formula: C17H22N2O4
InChI: InChI=1/C17H22N2O4/c1-6-7-18-9-13(20)19(16(18)22)10-23-15(21)14-12(8-11(2)3)17(14,4)5/h1,8,12,14H,7,9-10H2,2-5H3
45 atoms
O  0.166378 1.216939 0.77749
O  -0.489152 2.828816 2.170397
O  2.358805 1.746093 -1.639218
O  2.571506 -1.075443 1.935937
N  2.325805 0.601451 0.355996
N  3.441188 -1.227448 -0.193254
C  -2.586935 1.857122 -0.554588
C  -2.526402 0.495586 0.077771
C  -2.139273 1.711537 0.887983
C  -3.931098 2.511753 -0.768323
C  -1.596712 2.196452 -1.642536
C  -3.739543 -0.261398 0.448133
C  -0.763001 1.992138 1.352468
C  -4.052978 -1.501131 0.066423
C  -5.317174 -2.155317 0.537791
C  -3.21304 -2.350769 -0.838092
C  1.515288 1.489745 1.119386
C  2.634674 0.790361 -0.970464
C  2.759011 -0.645201 0.831044
C  3.389219 -0.451307 -1.400742
C  3.913342 -2.585071 -0.146242
C  3.128502 -3.47796 -0.996072
C  2.489612 -4.195923 -1.713568
H  -1.688819 -0.107095 -0.253313
H  -2.866625 2.055177 1.615675
H  -4.387811 2.148992 -1.690873
H  -4.633208 2.317111 0.040953
H  -3.819525 3.593863 -0.853446
H  -2.013408 1.922937 -2.613732
H  -1.394609 3.269055 -1.664417
H  -0.643534 1.684033 -1.54069
H  -4.438007 0.249187 1.104895
H  -5.102356 -3.077667 1.083575
H  -5.895294 -1.506968 1.195049
H  -5.954941 -2.433901 -0.304987
H  -2.90926 -3.27048 -0.33192
H  -3.78641 -2.65515 -1.717287
H  -2.312826 -1.853404 -1.191966
H  1.775471 2.519621 0.874357
H  1.69537 1.312289 2.178964
H  2.847266 -0.961132 -2.203819
H  4.381092 -0.18601 -1.777481
H  3.870548 -2.919839 0.8910
H  4.963506 -2.623504 -0.449889
H  1.916377 -4.8397 -2.336736
totalener: -1071.51797441 hartree
nucrepener: 1949.17225826 hartree
electener: -3020.69023267 hartree
oneelecener: -5329.99904478 hartree
twoeener: 2309.30881211 hartree
kineticenergy: 1066.93691837 hartree
xcener: -102.625974000156 hartree
chargesum: -0.0000000
charge: -0.268247 -0.358164 -0.340598 -0.376379 -0.146121 -0.169919 0.089923 0.081820 -0.103593 -0.242937 -0.246261 -0.210504 0.327042 -0.041648 -0.207065 -0.237991 0.069354 0.223146 0.341147 -0.018571 -0.089384 -0.398872 0.106494 0.079187 0.075393 0.089424 0.071481 0.094181 0.083247 0.092799 0.082677 0.074060 0.085213 0.077308 0.083158 0.089509 0.084469 0.077811 0.129373 0.130846 0.110106 0.103229 0.131675 0.124238 0.247946
qa: -0.2682 -0.3582 -0.3406 -0.3764 -0.1461 -0.1699 0.0899 0.0818 -0.1036 -0.2429 -0.2463 -0.2105 0.3270 -0.0416 -0.2071 -0.2380 0.0694 0.2231 0.3411 -0.0186 -0.0894 -0.3989 0.1065 0.0792 0.0754 0.0894 0.0715 0.0942 0.0832 0.0928 0.0827 0.0741 0.0852 0.0773 0.0832 0.0895 0.0845 0.0778 0.1294 0.1308 0.1101 0.1032 0.1317 0.1242 0.2479
va: 2.0901 2.1462 2.1706 2.1493 3.1326 3.1362 3.7334 3.7232 3.8986 3.9176 3.9243 3.9157 4.2512 3.8120 3.9380 3.9491 3.9142 4.2500 4.3387 3.8917 3.9121 3.7804 3.6350 1.0315 1.0363 1.0044 1.0112 1.0041 1.0026 1.0044 1.0154 1.0200 0.9979 1.0122 0.9982 0.9986 0.9995 1.0142 0.9990 1.0066 1.0109 1.0086 1.0100 0.9834 0.9710
dispcorr: -0.020975439 hartree
energy: -1071.538949851350
dipole: -28.63288 29.01212 0.37924 -5.37332 4.02640 -1.34692 -9.25680 7.93324 -1.32356
magnitude: 1.92609 au
magnitude: 4.89574 debye
