program: Orca
programVersion: 5.0.2
elementType: O O O O N N C C C C C C C C C C C C C C C C C H H H H H H H H H H H H H H H H H H H H H H
charge: 0
multiplicity: 1
keywords: wb97x-d3
keywords: def2-TZVPP
keywords: def2/J RIJCOSX
keywords: DEFGRID2
keywords: scfconv7
keywords: smallprint printgap noloewdin
keywords: NOSOSCF
formula: C17H22N2O4
InChI: InChI=1/C17H22N2O4/c1-6-7-18-9-13(20)19(16(18)22)10-23-15(21)14-12(8-11(2)3)17(14,4)5/h1,8,12,14H,7,9-10H2,2-5H3
45 atoms
O  0.362603 1.46566 1.361535
O  -0.103462 -0.696541 1.021375
O  1.984051 2.2222 -1.147808
O  3.021819 -1.411569 1.404804
N  2.346573 0.574235 0.415184
N  3.13911 -1.046252 -0.86602
C  -2.508036 0.702333 -0.505667
C  -2.972347 -0.031755 0.715856
C  -1.835794 0.944706 0.838212
C  -3.340971 1.844895 -1.031423
C  -1.783942 -0.057892 -1.590302
C  -4.271413 0.258651 1.377468
C  -0.466496 0.447031 1.083444
C  -5.456253 -0.17612 0.946369
C  -6.720807 0.127483 1.690686
C  -5.626828 -1.002661 -0.291619
C  1.732011 1.178707 1.558449
C  2.359857 1.125546 -0.84162
C  2.854045 -0.735626 0.428533
C  2.932084 0.060325 -1.755733
C  3.837459 -2.244672 -1.243513
C  5.202215 -1.981199 -1.695096
C  6.31233 -1.75018 -2.086077
H  -2.654588 -1.070739 0.761244
H  -2.052212 1.910385 1.28287
H  -3.839246 2.396936 -0.236255
H  -2.719226 2.545296 -1.591136
H  -4.116784 1.474935 -1.704798
H  -2.50077 -0.411699 -2.334184
H  -1.070668 0.588869 -2.106207
H  -1.246883 -0.925331 -1.212979
H  -4.237247 0.846561 2.290276
H  -7.214926 -0.791445 2.01581
H  -6.540536 0.740141 2.5731
H  -7.434855 0.655662 1.053886
H  -6.058797 -1.976857 -0.048805
H  -6.320568 -0.522561 -0.986256
H  -4.690367 -1.175402 -0.818438
H  2.187385 2.144856 1.763189
H  1.889471 0.509371 2.405007
H  2.224048 -0.166719 -2.557991
H  3.86281 0.410544 -2.213268
H  3.286734 -2.760793 -2.035512
H  3.849088 -2.911218 -0.380192
H  7.302433 -1.553006 -2.420074
totalener: -1071.51604731 hartree
nucrepener: 1958.91071667 hartree
electener: -3030.42676398 hartree
oneelecener: -5349.96685035 hartree
twoeener: 2319.54008637 hartree
kineticenergy: 1066.94357222 hartree
xcener: -102.628282092963 hartree
chargesum: 0.0000000
charge: -0.257145 -0.377012 -0.336283 -0.374920 -0.151051 -0.154063 0.083820 -0.022133 -0.092568 -0.251126 -0.288881 -0.195105 0.339879 -0.022266 -0.210702 -0.241718 0.078387 0.205149 0.354092 -0.023333 -0.090599 -0.402861 0.106123 0.109724 0.082501 0.083205 0.103869 0.083858 0.086313 0.094767 0.099924 0.089504 0.086885 0.079409 0.083926 0.098799 0.087487 0.081443 0.125442 0.134304 0.099243 0.111011 0.123870 0.130860 0.247973
qa: -0.2571 -0.3770 -0.3363 -0.3749 -0.1511 -0.1541 0.0838 -0.0221 -0.0926 -0.2511 -0.2889 -0.1951 0.3399 -0.0223 -0.2107 -0.2417 0.0784 0.2051 0.3541 -0.0233 -0.0906 -0.4029 0.1061 0.1097 0.0825 0.0832 0.1039 0.0839 0.0863 0.0948 0.0999 0.0895 0.0869 0.0794 0.0839 0.0988 0.0875 0.0814 0.1254 0.1343 0.0992 0.1110 0.1239 0.1309 0.2480
va: 2.1300 2.1255 2.1792 2.1541 3.0982 3.1261 3.7322 3.8154 3.8472 3.9062 3.8996 3.8622 4.2575 3.7413 3.9389 3.9359 3.9183 4.2752 4.3299 3.9025 3.9218 3.7847 3.6244 1.0252 1.0335 1.0072 1.0047 1.0016 1.0059 1.0051 1.0175 1.0134 0.9980 1.0105 0.9991 1.0033 0.9994 1.0105 0.9924 1.0153 1.0079 1.0107 0.9837 1.0110 0.9710
dispcorr: -0.022688280 hartree
energy: -1071.538735590286
dipole: -35.99217 35.67164 -0.32053 -0.22186 0.19504 -0.02682 -6.09591 5.20187 -0.89404
magnitude: 0.95014 au
magnitude: 2.41508 debye
