program: Orca
programVersion: 5.0.2
elementType: O O O O N N C C C C C C C C C C C C C C C C C H H H H H H H H H H H H H H H H H H H H H H
charge: 0
multiplicity: 1
keywords: wb97x-d3
keywords: def2-TZVPP
keywords: def2/J RIJCOSX
keywords: DEFGRID2
keywords: scfconv7
keywords: smallprint printgap noloewdin
keywords: NOSOSCF
formula: C17H22N2O4
InChI: InChI=1/C17H22N2O4/c1-6-7-18-9-13(20)19(16(18)22)10-23-15(21)14-12(8-11(2)3)17(14,4)5/h1,8,12,14H,7,9-10H2,2-5H3
45 atoms
O  0.307675 1.935106 0.724653
O  0.100868 -0.1293 1.565352
O  3.260699 -0.331755 1.954132
O  1.738818 1.489928 -1.942066
N  2.34724 0.854125 0.199408
N  2.707001 -0.547747 -1.471222
C  -2.346808 0.105589 -0.481049
C  -2.787078 -0.115774 0.939635
C  -1.803471 0.980902 0.633975
C  -3.287028 0.770935 -1.455404
C  -1.455326 -0.923515 -1.133106
C  -4.14444 0.22815 1.414334
C  -0.392385 0.836912 1.049458
C  -5.040094 -0.621446 1.92152
C  -6.375048 -0.139267 2.405023
C  -4.819826 -2.096923 2.064835
C  1.708202 1.916148 0.915461
C  2.972627 -0.220852 0.798645
C  2.212587 0.687318 -1.182499
C  3.256052 -1.204854 -0.318294
C  2.865321 -1.033922 -2.814335
C  4.268833 -1.160023 -3.20104
C  5.424203 -1.282768 -3.498624
H  -2.334938 -0.981356 1.412296
H  -2.171763 2.001623 0.632286
H  -3.896466 1.54535 -0.991802
H  -2.726399 1.233258 -2.269437
H  -3.967964 0.036979 -1.890152
H  -2.066727 -1.670684 -1.642489
H  -0.81198 -0.455668 -1.882135
H  -0.822068 -1.449762 -0.421293
H  -4.425441 1.275654 1.351616
H  -6.494619 0.936068 2.278812
H  -7.190669 -0.63379 1.871428
H  -6.51301 -0.368726 3.464738
H  -5.598977 -2.650735 1.535296
H  -3.860895 -2.433463 1.677691
H  -4.882998 -2.399793 3.112928
H  2.048788 2.881279 0.548547
H  1.974561 1.804605 1.96743
H  4.331837 -1.38225 -0.408835
H  2.769253 -2.16088 -0.105041
H  2.352516 -0.341551 -3.483506
H  2.371271 -2.004577 -2.920735
H  6.447413 -1.383462 -3.770147
totalener: -1071.51608497 hartree
nucrepener: 1973.28429069 hartree
electener: -3044.80037566 hartree
oneelecener: -5378.60528099 hartree
twoeener: 2333.80490533 hartree
kineticenergy: 1066.93928795 hartree
xcener: -102.628315678810 hartree
chargesum: 0.0000000
charge: -0.252576 -0.373493 -0.328780 -0.373952 -0.150184 -0.147332 0.130697 0.026013 -0.098513 -0.242296 -0.293885 -0.199149 0.320386 -0.035799 -0.208143 -0.237516 0.085813 0.250101 0.290161 -0.034035 -0.096023 -0.411829 0.123525 0.092398 0.073974 0.071966 0.099098 0.088931 0.094007 0.092012 0.089669 0.076808 0.077106 0.082957 0.086207 0.083685 0.081021 0.089798 0.125702 0.130350 0.113104 0.106561 0.128000 0.124673 0.248785
qa: -0.2526 -0.3735 -0.3288 -0.3740 -0.1502 -0.1473 0.1307 0.0260 -0.0985 -0.2423 -0.2939 -0.1991 0.3204 -0.0358 -0.2081 -0.2375 0.0858 0.2501 0.2902 -0.0340 -0.0960 -0.4118 0.1235 0.0924 0.0740 0.0720 0.0991 0.0889 0.0940 0.0920 0.0897 0.0768 0.0771 0.0830 0.0862 0.0837 0.0810 0.0898 0.1257 0.1303 0.1131 0.1066 0.1280 0.1247 0.2488
va: 2.1329 2.1280 2.1925 2.1485 3.0887 3.1217 3.7368 3.7927 3.8841 3.9054 3.9065 3.9022 4.2764 3.7964 3.9382 3.9484 3.9164 4.2458 4.3664 3.8862 3.9198 3.8227 3.6031 1.0319 1.0378 1.0103 1.0038 1.0049 1.0044 1.0071 1.0182 1.0189 1.0119 0.9987 0.9976 0.9998 1.0138 0.9991 0.9938 1.0139 1.0109 1.0083 1.0129 0.9824 0.9705
dispcorr: -0.022635220 hartree
energy: -1071.538720194031
dipole: -33.46356 33.15861 -0.30494 -8.26685 7.73532 -0.53153 0.36581 -1.16172 -0.79591
magnitude: 1.00448 au
magnitude: 2.55319 debye
