program: Orca
programVersion: 5.0.2
elementType: O O O O N N C C C C C C C C C C C C C C C C C H H H H H H H H H H H H H H H H H H H H H H
charge: 0
multiplicity: 1
keywords: wb97x-d3
keywords: def2-TZVPP
keywords: def2/J RIJCOSX
keywords: DEFGRID2
keywords: scfconv7
keywords: smallprint printgap noloewdin
keywords: NOSOSCF
formula: C17H22N2O4
InChI: InChI=1/C17H22N2O4/c1-6-7-18-9-13(20)19(16(18)22)10-23-15(21)14-12(8-11(2)3)17(14,4)5/h1,8,12,14H,7,9-10H2,2-5H3
45 atoms
O  -0.098359 -1.054528 0.50164
O  -1.513886 -1.364106 -1.213322
O  1.281638 0.12465 -2.174501
O  3.345154 -1.616877 1.496387
N  2.062536 -1.000215 -0.333126
N  3.966492 0.05333 0.037875
C  -2.476594 1.477085 -0.211621
C  -3.483311 0.425561 0.150458
C  -2.029145 0.213968 0.510738
C  -2.405286 2.752971 0.591712
C  -2.151766 1.683882 -1.670428
C  -4.469591 0.612051 1.233737
C  -1.22928 -0.810017 -0.182075
C  -5.786238 0.390431 1.158964
C  -6.670194 0.62284 2.347642
C  -6.50714 -0.086631 -0.064828
C  0.925762 -1.834204 -0.092296
C  2.127686 -0.070419 -1.337552
C  3.171727 -0.922818 0.520916
C  3.445506 0.638501 -1.171154
C  5.288234 0.338641 0.537377
C  6.332275 -0.180666 -0.346248
C  7.173906 -0.592907 -1.097785
H  -3.818353 -0.166448 -0.69481
H  -1.76057 0.363594 1.551087
H  -1.432339 3.231075 0.460391
H  -3.166692 3.460123 0.256126
H  -2.548793 2.594215 1.659758
H  -2.800632 2.462265 -2.07828
H  -1.120304 2.016388 -1.803857
H  -2.299531 0.791968 -2.275781
H  -4.072883 0.964419 2.181706
H  -7.442131 1.364424 2.123914
H  -7.197053 -0.292658 2.630703
H  -6.112453 0.970971 3.217172
H  -7.04584 -1.01533 0.141214
H  -7.261511 0.643334 -0.371155
H  -5.858474 -0.263189 -0.920545
H  1.206941 -2.61688 0.608001
H  0.599027 -2.289994 -1.024721
H  4.087189 0.452136 -2.038635
H  3.296927 1.717936 -1.078981
H  5.391801 -0.093448 1.533941
H  5.406546 1.419508 0.652594
H  7.915087 -0.971466 -1.767057
elementType: O N C H
totalener: -1071.54791630 hartree
nucrepener: 1908.50821440 hartree
electener: -2980.05613069 hartree
oneelecener: -5249.54284172 hartree
twoeener: 2269.48671103 hartree
cpcmener: -0.04202773 hartree
kineticenergy: 1066.84487486 hartree
xcener: -102.619885294087 hartree
chargesum: -0.0000000
charge: -0.279936 -0.447316 -0.448693 -0.486157 -0.116117 -0.155247 0.111193 0.038332 -0.096566 -0.266970 -0.278491 -0.276061 0.382931 -0.049153 -0.217820 -0.250683 0.068353 0.300648 0.383329 0.005517 -0.048681 -0.424133 0.058271 0.093001 0.090449 0.096860 0.097267 0.087941 0.098859 0.090980 0.094964 0.116542 0.092083 0.093059 0.088000 0.094949 0.095308 0.089825 0.130427 0.142070 0.123584 0.122960 0.130681 0.140057 0.283586
qa: -0.2799 -0.4473 -0.4487 -0.4862 -0.1161 -0.1552 0.1112 0.0383 -0.0966 -0.2670 -0.2785 -0.2761 0.3829 -0.0492 -0.2178 -0.2507 0.0684 0.3006 0.3833 0.0055 -0.0487 -0.4241 0.0583 0.0930 0.0904 0.0969 0.0973 0.0879 0.0989 0.0910 0.0950 0.1165 0.0921 0.0931 0.0880 0.0949 0.0953 0.0898 0.1304 0.1421 0.1236 0.1230 0.1307 0.1401 0.2836
va: 2.1087 2.0623 2.0670 2.0417 3.1195 3.1949 3.6921 3.7816 3.8295 3.9076 3.8970 3.8708 4.1935 3.7634 3.9212 3.9423 3.8801 4.1875 4.3174 3.8920 3.8977 3.7357 3.5792 1.0313 1.0359 1.0020 1.0023 1.0058 1.0016 1.0085 1.0175 1.0110 0.9964 0.9963 1.0090 0.9971 0.9973 1.0106 1.0150 1.0158 1.0049 1.0084 1.0074 0.9854 0.9479
dispcorr: -0.020605995 hartree
energy: -1071.568522290390
dipole: -33.16508 34.24969 1.08462 14.09508 -12.43436 1.66071 3.59294 -3.20748 0.38546
magnitude: 2.02063 au
magnitude: 5.13603 debye
